PDA

View Full Version : porting linux Qt apps to OS X (for a n00b)




wmmk
Dec 31, 2006, 02:56 PM
hello devs!
just saw that LightCrafts LightZone was upgraded to 2.0 recently, but the price is now $249, which is rather steep. I also found that they give away a Linux binary away for free. Just for fun I downloaded that and tried to run it in X11. Of course, it didn't work. Anyway, considering that OS X is UNIX- based, I'd expect that there's some way to get this to work. What can I do?
Thanks,
wmmk



Super Macho Man
Dec 31, 2006, 03:32 PM
I know that FreeBSD for x86 includes an optional Linux binary compatibility package. Mac OS X is based on FreeBSD but uses a different kernel. So maybe there is a similar solution for OS X (probably not). Of course you would need to have an Intel processor even if it were possible.

Otherwise you would probably have to use something like Virtual PC (PowerPC Macs) or Parallels/Boot Camp (Intel Macs) and install Linux in a VM.

Eric5h5
Jan 1, 2007, 01:00 AM
What can I do?

Nothing. OS X isn't Linux and Linux binaries won't work. If you had the source code you could try porting it though.

--Eric

GFLPraxis
Jan 1, 2007, 09:55 AM
You could install Linux into Parallels...

Mitthrawnuruodo
Jan 1, 2007, 10:14 AM
See if you can get it using Fink (http://fink.sourceforge.net/)...

speakerwizard
Jan 1, 2007, 10:16 AM
couldnt installin x11 help? i think this is out of my league so ill shut up now lol

mkrishnan
Jan 1, 2007, 10:19 AM
You could install Linux into Parallels...

Probably the most expedient solution... I think with systems like Fink, it's not that complex to re-engineer source code to run in Fink on OS X, but this is closed-source app.

BTW, does anyone use this app? I've never heard of it on photography websites before.

risc
Jan 1, 2007, 01:03 PM
couldnt installin x11 help? i think this is out of my league so ill shut up now lol

No; the only way having X11 installed would help is if the app was open source and the OP had the time to compile it (and all it's deps) for OS X. Since this app is closed source though there is no way it will work.

mkrishnan
Jan 1, 2007, 01:14 PM
No; the only way having X11 installed would help is if the app was open source and the OP had the time to compile it (and all it's deps) for OS X. Since this app is closed source though there is no way it will work.

Yes, absolutely. X11 is only a small subset of the APIs that the Linux binary needs access to, in order to run.

I was curious about the linux compatibility layer in BSD so I did some reading about it... can anyone help me understand what I read? :o

1) From what I understand, the linux compatibility layer is a relatively late addition to the FreeBSD kernel, and acts primarily at the kernel level.

2) OS X uses Mach, which is a somewhat older branching of FreeBSD, at least in the sense that NeXT was working with Mach before Linux really became so prominent as it is now.

3) So this means that Mach didn't inherit the compatibility layer, and as the kernel is owned by Apple, the fact that the compatibility layer has been developed by the FreeBSD people is pretty much useless towards the goal of an OS X / Linux compatibility layer, because only Apple can implement it by implementing it in their kernel.

Is that basically correct?

Don't get me wrong... in this proximal issue, this is nonsense to me. This application is readily available for OS X. If you want it, pay for it. But I'm curious about the general issue.

Compile 'em all
Jan 1, 2007, 01:17 PM
See if you can get it using Fink (http://fink.sourceforge.net/)...

Second the Fink advice. If you ever used Debian and apt-get, you will feel at home with fink. You can check as well Darwin ports.

risc
Jan 1, 2007, 01:23 PM
Is that basically correct?

OS X uses the XNU kernel not the FreeBSD one. So the tools wont be part of OS X. You can read more about the FreeBSD Linux compatibility layer here: http://www.freebsd.org/doc/en_US.ISO8859-1/books/handbook/linuxemu.html

Compile 'em all
Jan 1, 2007, 01:26 PM
Yes, absolutely. X11 is only a small subset of the APIs that the Linux binary needs access to, in order to run.

I was curious about the linux compatibility layer in BSD so I did some reading about it... can anyone help me understand what I read? :o

1) From what I understand, the linux compatibility layer is a relatively late addition to the FreeBSD kernel, and acts primarily at the kernel level.

2) OS X uses Mach, which is a somewhat older branching of FreeBSD, at least in the sense that NeXT was working with Mach before Linux really became so prominent as it is now.

3) So this means that Mach didn't inherit the compatibility layer, and as the kernel is owned by Apple, the fact that the compatibility layer has been developed by the FreeBSD people is pretty much useless towards the goal of an OS X / Linux compatibility layer, because only Apple can implement it by implementing it in their kernel.

Is that basically correct?


Just a minor correction.

Apple doesn't own the Mach kernel. OS X is based on the XNU kernel which is a hybrid kernel (as opposed to being monolithic or micro kernel). XNU is made up of the Mach kernel and FreeBSD components.

EDIT: risc beat me to it.

risc
Jan 1, 2007, 01:28 PM
Second the Fink advice. If you ever used Debian and apt-get, you will feel at home with fink. You can check as well Darwin ports.

Closed source apps are not going to be part of Fink or MacPorts. The FreeBSD Linux compatibility is kernel based so you will not find that at either location either.

mkrishnan
Jan 1, 2007, 01:29 PM
Sorry, I meant own in a project management sense, not in an intellectual property sense. :o What I meant is that only Apple can implement a change on the kernel. Which means that the fact that the compatibility layer exists for a relatively close sibling of the OS X kernel doesn't mean that a third-party could just go and implement Linux compatibility in OS X easily.

But also thank you for clarifying about the hybridity. I keep saying Mach, but I do recognize that what Apple uses is not the current official Mach branch.

GeeYouEye
Jan 2, 2007, 06:20 PM
Well, there's TECHNICALLY nothing stopping you from writing an ELF loader... but one does not exist at present.

Alternately, you could try downloading it (and binaries of all its dependencies), and running it in OpenFirmware, which DOES have an ELF loader.

Unfortunately, neither are very practical solutions.

wmmk
Jan 5, 2007, 11:33 PM
no big deal. there is another app (http://qtpfsgui.sourceforge.net/) which I do have the source for, but I'm a n00b who has no idea about porting stuff. how would I go about this? thanks!:)

therevolution
Jan 6, 2007, 12:53 AM
no big deal. there is another app (http://qtpfsgui.sourceforge.net/) which I do have the source for, but I'm a n00b who has no idea about porting stuff. how would I go about this? thanks!:)
Try to compile the source. Look at the errors. Fix them.

wmmk
Jan 6, 2007, 08:00 PM
Try to compile the source. Look at the errors. Fix them.

if it was obj-c, I could at least give this a shot, but it's Qt4. I tried configuring QT mac, but some directories were messed up or something. anyway, how would I go about correcting these errors. would this be obvious?

MisterMe
Jan 6, 2007, 09:52 PM
if it was obj-c, I could at least give this a shot, but it's Qt4. I tried configuring QT mac, but some directories were messed up or something. anyway, how would I go about correcting these errors. would this be obvious?Qt is a C++ cross-platform framework. Objective-C is an object-oriented version of the C programming language.

If you need help, it might be useful to explain which OS, which version of Qt, and which development environment you are using.

wmmk
Jan 7, 2007, 01:05 PM
Qt is a C++ cross-platform framework. Objective-C is an object-oriented version of the C programming language.

If you need help, it might be useful to explain which OS, which version of Qt, and which development environment you are using.

what i meant by the obj-c thing was that maybe then I could get this working in xcode, which I've used a bit. I'm not a programmer, just a photographer who wants to use a linux HDR creation app, and all of this is a bit over my head.:o To answer your question I'm using OS X 10.4.8, trying to use Qt4, and I don't even know what development environment I'm trying to use.

If it helps, the developer of the app sent me this a while ago
Hi,
I wanted to give it a try with the compiling process on mac:
first you need to download Qt4 from
www.trolltech.com/developer/downloads/qt/mac
then I found out that there's a darwin port of exiv2 as well, at:
exiv2.darwinports.com
the website right now doesn't seem to work, I found the google cache:
209.85.135.104/search?q=cache:yxwKEdb9SWAJ:exiv2.darwinports.com/+darwinports+exiv2&hl=en&ct=clnk&cd=1&client=firefox-a
As an alternative you can download the sources of exiv2 from:
www.exiv2.org/exiv2-0.12.tar.gz
untar it with:
tar xzf evix2-0.12.tar.gz
cd exiv2-0.12
./configure
make
make install
(last step as root)
Once you have Qt4 and exiv2 installed you can download the sources of qtpfsgui, type:
qmake
then with:
make
you compile the sources; at the end of the process you can run it with
./qtpfsgui
that should be it. I'd like to stress the "should" part because OS X could have its quirks that I don't know about. :)
Let me know,
Giuseppe
I know it seems cut and dry, but I just couldn't get Qt to configure properly...

MisterMe
Jan 7, 2007, 04:08 PM
.... I'm not a programmer, just a photographer who wants to use a linux HDR creation app, and all of this is a bit over my head.:o To answer your question I'm using OS X 10.4.8, trying to use Qt4, and I don't even know what development environment I'm trying to use.

....Instead of worrying about trying to compile an app, you should concern yourself with finding a MacOS X app which does what you need done. If you install the Qt4 frameworks on your Mac, any Qt4-dependent app which you install should just work. Again, which Linux HDR creation app and is there a Mac version of it already?

wmmk
Jan 7, 2007, 07:32 PM
Instead of worrying about trying to compile an app, you should concern yourself with finding a MacOS X app which does what you need done. If you install the Qt4 frameworks on your Mac, any Qt4-dependent app which you install should just work. Again, which Linux HDR creation app and is there a Mac version of it already?

the app is qtpfsgui (I linked to it earlier in this thread), no, there is not a mac version of it, and there is no open source Mac app that does the same thing. I know that there are free HDR mac apps, but they use tone mapping engines that I don't really like the output of, whereas qtpfsgui uses many operators, including the fattal contrast enhancing engine, which I really like. Anyway, this app is only available as platform independent source and Windows exe, so I'll have to compile.

wmmk
Jan 10, 2007, 04:34 PM
does anyone have any tips for this? sorry to bump, but this is really important for me:o
thanks/sorry...

Grover
Jan 10, 2007, 06:45 PM
If it helps, I tried this and QT4 installed fine for me following the instructions in their README file. Basically I did this:

1. Unzip and untar to desktop
2. CD into resulting directory
3. ./configure -universal
4. make
5. sudo make install
6. Add:

PATH=/usr/local/Trolltech/Qt-4.2.2/bin:$PATH
export PATH

to ~/.profile

I then compiled and installed exiv2 according to the instructions in their README - unzip, untar, cd to resulting directory and:

1. ./configure --without-zlib (because there was some other dependency I didn't want to fool with just to see if I could get this compiled.)
2. make
3. sudo make install

All of that appeared to go well.

Now when I went to compile qtpfsgui I got past the qmake stage OK (after changing the location of exiv2 to match the OSX path in the project.pro file as the instructions required).

At that point I went to make qtpfsgui and I get this:

src/hdrcreate/createhdr.cpp:15: error: 'open_memstream' was not declared in this scope
make: *** [generated_obj/createhdr.o] Error 1

At that point the code looks like:


#ifdef _WIN32
void createHDR(QList<QImage*> &list, const float * arrayofexptime, config_triple* chosen_config, bool antighosting, int iterations, const char * outfname) {
FILE *fpout=fopen(outfname,"wb");
#else
QByteArray createHDR(QList<QImage*> &list, const float * arrayofexptime, config_triple* chosen_config, bool antighosting, int iterations){
//prepare "fake" FILE* where pfs library will write the output hdr to, in pfs stream format.
char *pfshdr;
size_t size;
FILE * fpout=open_memstream(&pfshdr, &size);
#endif


So we're getting into the unix-specific code correctly and it's failing there. I'm not sure why - maybe open_memstream has some trick to it on OSX. Hopefully this is enough of a clue for someone else to spot what's going on.

Anyway, I didn't get the whole thing working but I can say that QT4 appears to install fine for me on an Intel Mac (for anyone else who wants to try this, be forewarned that building it takes a good long time) so with any luck you'll be able to get over that hurdle. It was necessary to read the documentation to catch that I had to specify the flag for a universal build and that I needed to add QT to my path so if you didn't do that, that may have been your QT problem.

wmmk
Jan 11, 2007, 04:03 PM
If it helps, I tried this and QT4 installed fine for me following the instructions in their README file. Basically I did this:

1. Unzip and untar to desktop
2. CD into resulting directory
3. ./configure -universal
4. make
5. sudo make install
6. Add:

PATH=/usr/local/Trolltech/Qt-4.2.2/bin:$PATH
export PATH

to ~/.profile

I then compiled and installed exiv2 according to the instructions in their README - unzip, untar, cd to resulting directory and:

1. ./configure --without-zlib (because there was some other dependency I didn't want to fool with just to see if I could get this compiled.)
2. make
3. sudo make install

All of that appeared to go well.

Now when I went to compile qtpfsgui I got past the qmake stage OK (after changing the location of exiv2 to match the OSX path in the project.pro file as the instructions required).

At that point I went to make qtpfsgui and I get this:

src/hdrcreate/createhdr.cpp:15: error: 'open_memstream' was not declared in this scope
make: *** [generated_obj/createhdr.o] Error 1

At that point the code looks like:


#ifdef _WIN32
void createHDR(QList<QImage*> &list, const float * arrayofexptime, config_triple* chosen_config, bool antighosting, int iterations, const char * outfname) {
FILE *fpout=fopen(outfname,"wb");
#else
QByteArray createHDR(QList<QImage*> &list, const float * arrayofexptime, config_triple* chosen_config, bool antighosting, int iterations){
//prepare "fake" FILE* where pfs library will write the output hdr to, in pfs stream format.
char *pfshdr;
size_t size;
FILE * fpout=open_memstream(&pfshdr, &size);
#endif


So we're getting into the unix-specific code correctly and it's failing there. I'm not sure why - maybe open_memstream has some trick to it on OSX. Hopefully this is enough of a clue for someone else to spot what's going on.

Anyway, I didn't get the whole thing working but I can say that QT4 appears to install fine for me on an Intel Mac (for anyone else who wants to try this, be forewarned that building it takes a good long time) so with any luck you'll be able to get over that hurdle. It was necessary to read the documentation to catch that I had to specify the flag for a universal build and that I needed to add QT to my path so if you didn't do that, that may have been your QT problem.
wow! thank you so(!) much!
this will be immensely helpful!
I'll get as far as I can with this, then MSN with the dev (he's in Italy) on saturday afternoon. hopefully, there will be a universal OS X build of qtpfsgui by Sunday morning. maybe I'll even photoshop some new buttons to make it mire mac-like!:D

wmmk
Jan 12, 2007, 05:26 PM
here's the error I get when trying to install Qt:
will-kamins-computer:~/desktop/qt-mac-opensource-src-4.2.2 williekamin$ ./configure -universal

This is the Qt/Mac Open Source Edition.

You don't seem to have 'make' or 'gmake' in your PATH.
Cannot proceed.

how can i fix this?

Grover
Jan 12, 2007, 06:23 PM
It sounds as if you don't have the developer tools installed. You'll need them to build from source. You should be able to find them on your original OSX install disc or you can download them from http://developer.apple.com/tools/xcode/.

wmmk
Jan 12, 2007, 07:05 PM
It sounds as if you don't have the developer tools installed. You'll need them to build from source. You should be able to find them on your original OSX install disc or you can download them from http://developer.apple.com/tools/xcode/.

ok. had them installed on the mac mini, but didn't take 'em over to the MBP because they just took up so much space...
can I either use an alternative or just install them, configure Qt, then uninstall them?
thanks so much! you've been a lifesaver, Grover!:)

wmmk
Jan 13, 2007, 06:11 PM
ok, installed dev tools and gcc 4.0.
I got this:
Creating qmake. Please wait...
c++ -c -o project.o -arch i386 -arch ppc -pipe -DQMAKE_OPENSOURCE_EDITION -g -I. -Igenerators -Igenerators/unix -Igenerators/win32 -Igenerators/mac -I/Users/williekamin/Desktop/qt-mac-opensource-src-4.2.2/src/corelib/arch/generic -I/Users/williekamin/Desktop/qt-mac-opensource-src-4.2.2/include -I/Users/williekamin/Desktop/qt-mac-opensource-src-4.2.2/include/QtCore -I/Users/williekamin/Desktop/qt-mac-opensource-src-4.2.2/include -I/Users/williekamin/Desktop/qt-mac-opensource-src-4.2.2/include/QtCore -I/Users/williekamin/Desktop/qt-mac-opensource-src-4.2.2/src/corelib/global -I/Users/williekamin/Desktop/qt-mac-opensource-src-4.2.2/src/3rdparty/md5 -DQT_NO_TEXTCODEC -DQT_NO_UNICODETABLES -DQT_NO_COMPONENT -DQT_NO_STL -DQT_BUILD_QMAKE -DQT_NO_COMPRESS -I/Users/williekamin/Desktop/qt-mac-opensource-src-4.2.2/mkspecs/macx-g++ -DHAVE_QCONFIG_CPP -DQT_NO_THREAD -DQT_NO_QOBJECT -DQT_NO_GEOM_VARIANT project.cpp
In file included from /Users/williekamin/Desktop/qt-mac-opensource-src-4.2.2/include/QtCore/qglobal.h:1,
from /Users/williekamin/Desktop/qt-mac-opensource-src-4.2.2/include/QtCore/../../src/corelib/tools/qalgorithms.h:27,
from /Users/williekamin/Desktop/qt-mac-opensource-src-4.2.2/include/QtCore/qalgorithms.h:1,
from /Users/williekamin/Desktop/qt-mac-opensource-src-4.2.2/include/QtCore/../../src/corelib/tools/qstringlist.h:27,
from /Users/williekamin/Desktop/qt-mac-opensource-src-4.2.2/include/QtCore/qstringlist.h:1,
from project.h:27,
from project.cpp:24:
/Users/williekamin/Desktop/qt-mac-opensource-src-4.2.2/include/QtCore/../../src/corelib/global/qglobal.h:858:34: error: AvailabilityMacros.h: No such file or directory
In file included from /Users/williekamin/Desktop/qt-mac-opensource-src-4.2.2/include/QtCore/qglobal.h:1,
from /Users/williekamin/Desktop/qt-mac-opensource-src-4.2.2/include/QtCore/../../src/corelib/tools/qalgorithms.h:27,
from /Users/williekamin/Desktop/qt-mac-opensource-src-4.2.2/include/QtCore/qalgorithms.h:1,
from /Users/williekamin/Desktop/qt-mac-opensource-src-4.2.2/include/QtCore/../../src/corelib/tools/qstringlist.h:27,
from /Users/williekamin/Desktop/qt-mac-opensource-src-4.2.2/include/QtCore/qstringlist.h:1,
from project.h:27,
from project.cpp:24:
/Users/williekamin/Desktop/qt-mac-opensource-src-4.2.2/include/QtCore/../../src/corelib/global/qglobal.h:858:34: error: AvailabilityMacros.h: No such file or directory
In file included from /Users/williekamin/Desktop/qt-mac-opensource-src-4.2.2/include/QtCore/qbytearray.h:1In file included from /Users/williekamin/Desktop/qt-mac-opensource-src-4.2.2/include/QtCore/qbytearray.h:1,
from /Users/williekamin/Desktop/qt-mac-opensource-src-4.2.2/include/QtCore/../../src/corelib/tools/qstring.h:28,
from /Users/williekamin/Desktop/qt-mac-opensource-src-4.2.2/include/QtCore/qstring.h:1,
from /Users/williekamin/Desktop/qt-mac-opensource-src-4.2.2/include/QtCore/../../src/corelib/io/qiodevice.h:32,
from /Users/williekamin/Desktop/qt-mac-opensource-src-4.2.2/include/QtCore/qiodevice.h:1,
from /Users/williekamin/Desktop/qt-mac-opensource-src-4.2.2/include/QtCore/../../src/corelib/io/qdatastream.h:27,
from /Users/williekamin/Desktop/qt-mac-opensource-src-4.2.2/include/QtCore/qdatastream.h:1,
from /Users/williekamin/Desktop/qt-mac-opensource-src-4.2.2/include/QtCore/../../src/corelib/tools/qstringlist.h:28,
from /Users/williekamin/Desktop/qt-mac-opensource-src-4.2.2/include/QtCore/qstringlist.h:1,
from project.h:27,
from project.cpp:24:
/Users/williekamin/Desktop/qt-mac-opensource-src-4.2.2/include/QtCore/../../src/corelib/tools/qbytearray.h:30:20: error: string.h: No such file or directory
,
from /Users/williekamin/Desktop/qt-mac-opensource-src-4.2.2/include/QtCore/../../src/corelib/tools/qstring.h:28,
from /Users/williekamin/Desktop/qt-mac-opensource-src-4.2.2/include/QtCore/qstring.h:1,
from /Users/williekamin/Desktop/qt-mac-opensource-src-4.2.2/include/QtCore/../../src/corelib/io/qiodevice.h:32,
from /Users/williekamin/Desktop/qt-mac-opensource-src-4.2.2/include/QtCore/qiodevice.h:1,
from /Users/williekamin/Desktop/qt-mac-opensource-src-4.2.2/include/QtCore/../../src/corelib/io/qdatastream.h:27,
from /Users/williekamin/Desktop/qt-mac-opensource-src-4.2.2/include/QtCore/qdatastream.h:1,
from /Users/williekamin/Desktop/qt-mac-opensource-src-4.2.2/include/QtCore/../../src/corelib/tools/qstringlist.h:28,
from /Users/williekamin/Desktop/qt-mac-opensource-src-4.2.2/include/QtCore/qstringlist.h:1,
from project.h:27,
from project.cpp:24:
/Users/williekamin/Desktop/qt-mac-opensource-src-4.2.2/include/QtCore/../../src/corelib/tools/qbytearray.h:30:20: error: string.h: No such file or directory
In file included from /Users/williekamin/Desktop/qt-mac-opensource-src-4.2.2/include/QtCore/qlist.h:1,
from /Users/williekamin/Desktop/qt-mac-opensource-src-4.2.2/include/QtCore/../../src/corelib/tools/qstringlist.h:29,
from /Users/williekamin/Desktop/qt-mac-opensource-src-4.2.2/include/QtCore/qstringlist.h:1,
from project.h:27,
from project.cpp:24:
/Users/williekamin/Desktop/qt-mac-opensource-src-4.2.2/include/QtCore/../../src/corelib/tools/qlist.h:36:15: error: new: No such file or directory
In file included from /Users/williekamin/Desktop/qt-mac-opensource-src-4.2.2/include/QtCore/qlist.h:1,
from /Users/williekamin/Desktop/qt-mac-opensource-src-4.2.2/include/QtCore/../../src/corelib/tools/qstringlist.h:29,
from /Users/williekamin/Desktop/qt-mac-opensource-src-4.2.2/include/QtCore/qstringlist.h:1,
from project.h:27,
from project.cpp:24:
/Users/williekamin/Desktop/qt-mac-opensource-src-4.2.2/include/QtCore/../../src/corelib/tools/qlist.h:36:15: error: new: No such file or directory
In file included from /Users/williekamin/Desktop/qt-mac-opensource-src-4.2.2/include/QtCore/qtextstream.h:1In file included from /Users/williekamin/Desktop/qt-mac-opensource-src-4.2.2/include/QtCore/qtextstream.h:1,
from project.h:28,
from project.cpp:24:
/Users/williekamin/Desktop/qt-mac-opensource-src-4.2.2/include/QtCore/../../src/corelib/io/qtextstream.h:37:19: error: stdio.h: No such file or directory
,
from project.h:28,
from project.cpp:24:
/Users/williekamin/Desktop/qt-mac-opensource-src-4.2.2/include/QtCore/../../src/corelib/io/qtextstream.h:37:19: error: stdio.h: No such file or directory
In file included from /Users/williekamin/Desktop/qt-mac-opensource-src-4.2.2/include/QtCore/qvector.h:1,
from /Users/williekamin/Desktop/qt-mac-opensource-src-4.2.2/include/QtCore/../../src/corelib/tools/qstack.h:27,
from /Users/williekamin/Desktop/qt-mac-opensource-src-4.2.2/include/QtCore/qstack.h:1,
from project.h:30,
from project.cpp:24:
/Users/williekamin/Desktop/qt-mac-opensource-src-4.2.2/include/QtCore/../../src/corelib/tools/qvector.h:36:20: error: stdlib.h: No such file or directory
In file included from /Users/williekamin/Desktop/qt-mac-opensource-src-4.2.2/include/QtCore/qvector.h:1,
from /Users/williekamin/Desktop/qt-mac-opensource-src-4.2.2/include/QtCore/../../src/corelib/tools/qstack.h:27,
from /Users/williekamin/Desktop/qt-mac-opensource-src-4.2.2/include/QtCore/qstack.h:1,
from project.h:30,
from project.cpp:24:
/Users/williekamin/Desktop/qt-mac-opensource-src-4.2.2/include/QtCore/../../src/corelib/tools/qvector.h:36:20: error: stdlib.h: No such file or directory
project.cpp:39:20: project.cpp:39:20:error: unistd.h: No such file or directory
error: project.cpp:40:25: error: sys/utsname.h: No such file or directory
unistd.h: No such file or directory
project.cpp:40:25: error: sys/utsname.h: No such file or directory
/Users/williekamin/Desktop/qt-mac-opensource-src-4.2.2/include/QtCore/../../src/corelib/tools/qbytearray.h: In function 'uint qstrlen(const char*)':
/Users/williekamin/Desktop/qt-mac-opensource-src-4.2.2/include/QtCore/../../src/corelib/tools/qbytearray.h:48: error: 'strlen' was not declared in this scope
/Users/williekamin/Desktop/qt-mac-opensource-src-4.2.2/include/QtCore/../../src/corelib/tools/qbytearray.h: In function 'int qstrncmp(const char*, const char*, uint)':
/Users/williekamin/Desktop/qt-mac-opensource-src-4.2.2/include/QtCore/../../src/corelib/tools/qbytearray.h:67: error: 'strncmp' was not declared in this scope
/Users/williekamin/Desktop/qt-mac-opensource-src-4.2.2/include/QtCore/../../src/corelib/tools/qbytearray.h: In function 'bool operator==(const QByteArray&, const QByteArray&)':
/Users/williekamin/Desktop/qt-mac-opensource-src-4.2.2/include/QtCore/../../src/corelib/tools/qbytearray.h:434: error: 'memcmp' was not declared in this scope
/Users/williekamin/Desktop/qt-mac-opensource-src-4.2.2/include/QtCore/../../src/corelib/tools/qbytearray.h: In function 'bool operator==(const QByteArray&, const char*)':
/Users/williekamin/Desktop/qt-mac-opensource-src-4.2.2/include/QtCore/../../src/corelib/tools/qbytearray.h:436: error: 'strcmp' was not declared in this scope
/Users/williekamin/Desktop/qt-mac-opensource-src-4.2.2/include/QtCore/../../src/corelib/tools/qbytearray.h: In function 'bool operator==(const char*, const QByteArray&)':
/Users/williekamin/Desktop/qt-mac-opensource-src-4.2.2/include/QtCore/../../src/corelib/tools/qbytearray.h:438: error: 'strcmp' was not declared in this scope
/Users/williekamin/Desktop/qt-mac-opensource-src-4.2.2/include/QtCore/../../src/corelib/tools/qbytearray.h: In function 'bool operator!=(const QByteArray&, const char*)':
/Users/williekamin/Desktop/qt-mac-opensource-src-4.2.2/include/QtCore/../../src/corelib/tools/qbytearray.h:442: error: 'strcmp' was not declared in this scope
/Users/williekamin/Desktop/qt-mac-opensource-src-4.2.2/include/QtCore/../../src/corelib/tools/qbytearray.h: In function 'bool operator!=(const char*, const QByteArray&)':
/Users/williekamin/Desktop/qt-mac-opensource-src-4.2.2/include/QtCore/../../src/corelib/tools/qbytearray.h:444: error: 'strcmp' was not declared in this scope
/Users/williekamin/Desktop/qt-mac-opensource-src-4.2.2/include/QtCore/../../src/corelib/tools/qbytearray.h: In function 'bool operator<(const QByteArray&, const QByteArray&)':
/Users/williekamin/Desktop/qt-mac-opensource-src-4.2.2/include/QtCore/../../src/corelib/tools/qbytearray.h:446: error: 'strcmp' was not declared in this scope
/Users/williekamin/Desktop/qt-mac-opensource-src-4.2.2/include/QtCore/../../src/corelib/tools/qbytearray.h: In function 'bool operator<=(const QByteArray&, const QByteArray&)':
/Users/williekamin/Desktop/qt-mac-opensource-src-4.2.2/include/QtCore/../../src/corelib/tools/qbytearray.h:452: error: 'strcmp' was not declared in this scope
/Users/williekamin/Desktop/qt-mac-opensource-src-4.2.2/include/QtCore/../../src/corelib/tools/qbytearray.h: In function 'bool operator>(const QByteArray&, const QByteArray&)':
/Users/williekamin/Desktop/qt-mac-opensource-src-4.2.2/include/QtCore/../../src/corelib/tools/qbytearray.h:458: error: 'strcmp' was not declared in this scope
/Users/williekamin/Desktop/qt-mac-opensource-src-4.2.2/include/QtCore/../../src/corelib/tools/qbytearray.h: In function 'bool operator>=(const QByteArray&, const QByteArray&)':
/Users/williekamin/Desktop/qt-mac-opensource-src-4.2.2/include/QtCore/../../src/corelib/tools/qbytearray.h:464: error: 'strcmp' was not declared in this scope
/Users/williekamin/Desktop/qt-mac-opensource-src-4.2.2/include/QtCore/../../src/corelib/tools/qbytearray.h: In function 'uint qstrlen(const char*)':
/Users/williekamin/Desktop/qt-mac-opensource-src-4.2.2/include/QtCore/../../src/corelib/tools/qbytearray.h:48: error: 'strlen' was not declared in this scope
/Users/williekamin/Desktop/qt-mac-opensource-src-4.2.2/include/QtCore/../../src/corelib/tools/qbytearray.h: In function 'int qstrncmp(const char*, const char*, uint)':
/Users/williekamin/Desktop/qt-mac-opensource-src-4.2.2/include/QtCore/../../src/corelib/tools/qbytearray.h:67: error: 'strncmp' was not declared in this scope
/Users/williekamin/Desktop/qt-mac-opensource-src-4.2.2/include/QtCore/../../src/corelib/tools/qbytearray.h: In function 'bool operator==(const QByteArray&, const QByteArray&)':
/Users/williekamin/Desktop/qt-mac-opensource-src-4.2.2/include/QtCore/../../src/corelib/tools/qbytearray.h:434: error: 'memcmp' was not declared in this scope
/Users/williekamin/Desktop/qt-mac-opensource-src-4.2.2/include/QtCore/../../src/corelib/tools/qbytearray.h: In function 'bool operator==(const QByteArray&, const char*)':
/Users/williekamin/Desktop/qt-mac-opensource-src-4.2.2/include/QtCore/../../src/corelib/tools/qbytearray.h:436: error: 'strcmp' was not declared in this scope
/Users/williekamin/Desktop/qt-mac-opensource-src-4.2.2/include/QtCore/../../src/corelib/tools/qbytearray.h: In function 'bool operator==(const char*, const QByteArray&)':
/Users/williekamin/Desktop/qt-mac-opensource-src-4.2.2/include/QtCore/../../src/corelib/tools/qbytearray.h:438: error: 'strcmp' was not declared in this scope
/Users/williekamin/Desktop/qt-mac-opensource-src-4.2.2/include/QtCore/../../src/corelib/tools/qbytearray.h: In function 'bool operator!=(const QByteArray&, const char*)':
/Users/williekamin/Desktop/qt-mac-opensource-src-4.2.2/include/QtCore/../../src/corelib/tools/qbytearray.h:442: error: 'strcmp' was not declared in this scope
/Users/williekamin/Desktop/qt-mac-opensource-src-4.2.2/include/QtCore/../../src/corelib/tools/qbytearray.h: In function 'bool operator!=(const char*, const QByteArray&)':
/Users/williekamin/Desktop/qt-mac-opensource-src-4.2.2/include/QtCore/../../src/corelib/tools/qbytearray.h:444: error: 'strcmp' was not declared in this scope
/Users/williekamin/Desktop/qt-mac-opensource-src-4.2.2/include/QtCore/../../src/corelib/tools/qbytearray.h: In function 'bool operator<(const QByteArray&, const QByteArray&)':
/Users/williekamin/Desktop/qt-mac-opensource-src-4.2.2/include/QtCore/../../src/corelib/tools/qbytearray.h:446: error: 'strcmp' was not declared in this scope
/Users/williekamin/Desktop/qt-mac-opensource-src-4.2.2/include/QtCore/../../src/corelib/tools/qbytearray.h: In function 'bool operator<=(const QByteArray&, const QByteArray&)':
/Users/williekamin/Desktop/qt-mac-opensource-src-4.2.2/include/QtCore/../../src/corelib/tools/qbytearray.h:452: error: 'strcmp' was not declared in this scope
/Users/williekamin/Desktop/qt-mac-opensource-src-4.2.2/include/QtCore/../../src/corelib/tools/qbytearray.h: In function 'bool operator>(const QByteArray&, const QByteArray&)':
/Users/williekamin/Desktop/qt-mac-opensource-src-4.2.2/include/QtCore/../../src/corelib/tools/qbytearray.h:458: error: 'strcmp' was not declared in this scope
/Users/williekamin/Desktop/qt-mac-opensource-src-4.2.2/include/QtCore/../../src/corelib/tools/qbytearray.h: In function 'bool operator>=(const QByteArray&, const QByteArray&)':
/Users/williekamin/Desktop/qt-mac-opensource-src-4.2.2/include/QtCore/../../src/corelib/tools/qbytearray.h:464: error: 'strcmp' was not declared in this scope
/Users/williekamin/Desktop/qt-mac-opensource-src-4.2.2/include/QtCore/../../src/corelib/io/qtextstream.h: At global scope:
/Users/williekamin/Desktop/qt-mac-opensource-src-4.2.2/include/QtCore/../../src/corelib/io/qtextstream.h:83: error: expected `)' before '*' token
/Users/williekamin/Desktop/qt-mac-opensource-src-4.2.2/include/QtCore/../../src/corelib/io/qfile.h:126: error: 'FILE' has not been declared
/Users/williekamin/Desktop/qt-mac-opensource-src-4.2.2/include/QtCore/../../src/corelib/io/qtextstream.h: At global scope:
/Users/williekamin/Desktop/qt-mac-opensource-src-4.2.2/include/QtCore/../../src/corelib/io/qtextstream.h:83: error: expected `)' before '*' token
cachekeys.h: In function 'void qmakeFreeCacheClear(void*)':
cachekeys.h:155: error: 'free' was not declared in this scope
/Users/williekamin/Desktop/qt-mac-opensource-src-4.2.2/include/QtCore/../../src/corelib/io/qfile.h:126: error: 'FILE' has not been declared
cachekeys.h: In function 'void qmakeFreeCacheClear(void*)':
cachekeys.h:155: error: 'free' was not declared in this scope
project.cpp: In function 'void qmake_error_msg(const QString&)':
project.cpp:392: error: 'stderr' was not declared in this scope
project.cpp:393: error: 'fprintf' was not declared in this scope
project.cpp: In member function 'void QMakeProjectEnv::init(const QMap<QString, QStringList>&)':
project.cpp:514: error: 'strdup' was not declared in this scope
project.cpp:514: error: 'putenv' was not declared in this scope
project.cpp: In destructor 'QMakeProjectEnv::~QMakeProjectEnv()':
project.cpp:526: error: 'strdup' was not declared in this scope
project.cpp:526: error: 'putenv' was not declared in this scope
project.cpp: In member function 'bool QMakeProject::parse(const QString&, QMap<QString, QStringList>&)':
project.cpp:584: error: 'stderr' was not declared in this scope
project.cpp:584: error: 'fprintf' was not declared in this scope
project.cpp:747: error: 'stderr' was not declared in this scope
project.cpp:748: error: 'fprintf' was not declared in this scope
project.cpp:752: error: 'stderr' was not declared in this scope
project.cpp:753: error: 'fprintf' was not declared in this scope
project.cpp:756: error: 'stderr' was not declared in this scope
project.cpp:757: error: 'fprintf' was not declared in this scope
project.cpp:769: error: 'stderr' was not declared in this scope
project.cpp:770: error: 'fprintf' was not declared in this scope
project.cpp:810: error: 'stderr' was not declared in this scope
project.cpp:812: error: 'fprintf' was not declared in this scope
project.cpp:816: error: 'stderr' was not declared in this scope
project.cpp:817: error: 'fprintf' was not declared in this scope
project.cpp:826: error: 'stderr' was not declared in this scope
project.cpp:827: error: 'fprintf' was not declared in this scope
project.cpp:884: error: 'stderr' was not declared in this scope
project.cpp:884: error: 'fprintf' was not declared in this scope
project.cpp:957: error: 'stdout' was not declared in this scope
project.cpp:957: error: 'fprintf' was not declared in this scope
project.cpp:960: error: 'stdout' was not declared in this scope
project.cpp:960: error: 'fprintf' was not declared in this scope
project.cpp: In function 'void qmake_error_msg(const QString&)':
project.cpp:392: error: 'stderr' was not declared in this scope
project.cpp:393: error: 'fprintf' was not declared in this scope
project.cpp: In member function 'bool QMakeProject::read(const QString&, QMap<QString, QStringList>&)':
project.cpp:1092: error: 'strcmp' was not declared in this scope
project.cpp:1094: error: 'stdin' was not declared in this scope
project.cpp: In member function 'bool QMakeProject::read(uchar)':
project.cpp:1186: error: 'stderr' was not declared in this scope
project.cpp:1186: error: 'fprintf' was not declared in this scope
project.cpp:1204: error: 'stderr' was not declared in this scope
project.cpp:1205: error: 'fprintf' was not declared in this scope
project.cpp:1222: error: 'stderr' was not declared in this scope
project.cpp:1222: error: 'fprintf' was not declared in this scope
project.cpp:1254: error: 'stderr' was not declared in this scope
project.cpp:1254: error: 'fprintf' was not declared in this scope
project.cpp: In member function 'void QMakeProjectEnv::init(const QMap<QString, QStringList>&)':
project.cpp:514: error: 'strdup' was not declared in this scope
project.cpp:514: error: 'putenv' was not declared in this scope
project.cpp: In destructor 'QMakeProjectEnv::~QMakeProjectEnv()':
project.cpp:526: error: 'strdup' was not declared in this scope
project.cpp:526: error: 'putenv' was not declared in this scope
project.cpp:1295: error: 'stderr' was not declared in this scope
project.cpp:1295: error: 'fprintf' was not declared in this scope
project.cpp: In member function 'bool QMakeProject::parse(const QString&, QMap<QString, QStringList>&)':
project.cpp:584: error: 'stderr' was not declared in this scope
project.cpp:584: error: 'fprintf' was not declared in this scope
project.cpp: In member function 'bool QMakeProject::isActiveConfig(const QString&, bool, QMap<QString, QStringList>*)':
project.cpp:1383: error: 'malloc' was not declared in this scope
project.cpp:1386: error: 'readlink' was not declared in this scope
project.cpp:747: error: 'stderr' was not declared in this scope
project.cpp:748: error: 'fprintf' was not declared in this scope
project.cpp:752: error: 'stderr' was not declared in this scope
project.cpp:753: error: 'fprintf' was not declared in this scope
project.cpp:756: error: 'stderr' was not declared in this scope
project.cpp:757: error: 'fprintf' was not declared in this scope
project.cpp:769: error: 'stderr' was not declared in this scope
project.cpp:770: error: 'fprintf' was not declared in this scope
project.cpp:810: error: 'stderr' was not declared in this scope
project.cpp:812: error: 'fprintf' was not declared in this scope
project.cpp:816: error: 'stderr' was not declared in this scope
project.cpp:817: error: 'fprintf' was not declared in this scope
project.cpp:826: error: 'stderr' was not declared in this scope
project.cpp:827: error: 'fprintf' was not declared in this scope
project.cpp:884: error: 'stderr' was not declared in this scope
project.cpp:884: error: 'fprintf' was not declared in this scope
project.cpp:957: error: 'stdout' was not declared in this scope
project.cpp:957: error: 'fprintf' was not declared in this scope
project.cpp:960: error: 'stdout' was not declared in this scope
project.cpp:960: error: 'fprintf' was not declared in this scope
project.cpp: In member function 'QMakeProject::IncludeStatus QMakeProject::doProjectInclude(QString, uchar, QMap<QString, QStringList>&)':
project.cpp:1523: error: 'stderr' was not declared in this scope
project.cpp:1525: error: 'fprintf' was not declared in this scope
project.cpp:1533: error: 'stderr' was not declared in this scope
project.cpp:1533: error: 'fprintf' was not declared in this scope
project.cpp: In member function 'QStringList QMakeProject::doProjectExpand(QString, QList<QStringList>, QMap<QString, QStringList>&)':
project.cpp:1657: error: 'stderr' was not declared in this scope
project.cpp:1658: error: 'fprintf' was not declared in this scope
project.cpp:1676: error: 'stderr' was not declared in this scope
project.cpp:1678: error: 'fprintf' was not declared in this scope
project.cpp:1684: error: 'stderr' was not declared in this scope
project.cpp:1686: error: 'fprintf' was not declared in this scope
project.cpp:1709: error: 'stderr' was not declared in this scope
project.cpp:1710: error: 'fprintf' was not declared in this scope
project.cpp:1723: error: 'stderr' was not declared in this scope
project.cpp:1724: error: 'fprintf' was not declared in this scope
project.cpp:1747: error: 'stderr' was not declared in this scope
project.cpp:1748: error: 'fprintf' was not declared in this scope
project.cpp:1769: error: 'stderr' was not declared in this scope
project.cpp:1770: error: 'fprintf' was not declared in this scope
project.cpp:1780: error: 'stderr' was not declared in this scope
project.cpp:1781: error: 'fprintf' was not declared in this scope
project.cpp:1800: error: 'stderr' was not declared in this scope
project.cpp:1801: error: 'fprintf' was not declared in this scope
project.cpp:1811: error: 'stderr' was not declared in this scope
project.cpp:1812: error: 'fprintf' was not declared in this scope
project.cpp:1828: error: 'stderr' was not declared in this scope
project.cpp:1829: error: 'fprintf' was not declared in this scope
project.cpp:1850: error: 'stderr' was not declared in this scope
project.cpp:1851: error: 'fprintf' was not declared in this scope
project.cpp:1861: error: 'stderr' was not declared in this scope
project.cpp:1862: error: 'fprintf' was not declared in this scope
project.cpp:1886: error: 'stderr' was not declared in this scope
project.cpp:1887: error: 'fprintf' was not declared in this scope
project.cpp:1900: error: 'stderr' was not declared in this scope
project.cpp:1901: error: 'fprintf' was not declared in this scope
project.cpp:1906: error: 'FILE' was not declared in this scope
project.cpp:1906: error: 'proc' was not declared in this scope
project.cpp:1906: error: 'popen' was not declared in this scope
project.cpp:1911: error: 'feof' was not declared in this scope
project.cpp:1912: error: 'fread' was not declared in this scope
project.cpp:1927: error: 'stderr' was not declared in this scope
project.cpp:1928: error: 'fprintf' was not declared in this scope
project.cpp: In member function 'bool QMakeProject::read(const QString&, QMap<QString, QStringList>&)':
project.cpp:1092: error: 'strcmp' was not declared in this scope
project.cpp:1094: error: 'stdin' was not declared in this scope
project.cpp:1961: error: 'memcpy' was not declared in this scope
project.cpp:1987: error: 'stderr' was not declared in this scope
project.cpp:1988: error: 'fprintf' was not declared in this scope
project.cpp:2026: error: 'stderr' was not declared in this scope
project.cpp:2027: error: 'fprintf' was not declared in this scope
project.cpp:2029: error: 'stderr' was not declared in this scope
project.cpp:2030: error: 'fprintf' was not declared in this scope
project.cpp:2035: error: 'stderr' was not declared in this scope
project.cpp:2036: error: 'fprintf' was not declared in this scope
project.cpp:2039: error: 'stdin' was not declared in this scope
project.cpp:2047: error: 'stderr' was not declared in this scope
project.cpp: In member function 'bool QMakeProject::read(uchar)':
project.cpp:1186: error: 'stderr' was not declared in this scope
project.cpp:1186: error: 'fprintf' was not declared in this scope
project.cpp:1204: error: 'stderr' was not declared in this scope
project.cpp:1205: error: 'fprintf' was not declared in this scope
project.cpp:1222: error: 'stderr' was not declared in this scope
project.cpp:1222: error: 'fprintf' was not declared in this scope
project.cpp:1254: error: 'stderr' was not declared in this scope
project.cpp:1254: error: 'fprintf' was not declared in this scope
project.cpp:2048: error: 'fprintf' was not declared in this scope
project.cpp:2058: error: 'stderr' was not declared in this scope
project.cpp:2060: error: 'fprintf' was not declared in this scope
project.cpp:1295: error: 'stderr' was not declared in this scope
project.cpp:1295: error: 'fprintf' was not declared in this scope
project.cpp: In member function 'bool QMakeProject::isActiveConfig(const QString&, bool, QMap<QString, QStringList>*)':
project.cpp:1383: error: 'malloc' was not declared in this scope
project.cpp:1386: error: 'readlink' was not declared in this scope
project.cpp: In member function 'bool QMakeProject::doProjectTest(QString, QList<QStringList>, QMap<QString, QStringList>&)':
project.cpp:2103: error: 'stderr' was not declared in this scope
project.cpp:2106: error: 'fprintf' was not declared in this scope
project.cpp:2122: error: 'stderr' was not declared in this scope
project.cpp:2123: error: 'fprintf' was not declared in this scope
project.cpp:2142: error: 'stderr' was not declared in this scope
project.cpp:2143: error: 'fprintf' was not declared in this scope
project.cpp:2149: error: 'stderr' was not declared in this scope
project.cpp:2150: error: 'fprintf' was not declared in this scope
project.cpp:2168: error: 'stderr' was not declared in this scope
project.cpp:2169: error: 'fprintf' was not declared in this scope
project.cpp:2181: error: 'stderr' was not declared in this scope
project.cpp:2182: error: 'fprintf' was not declared in this scope
project.cpp:2191: error: 'stderr' was not declared in this scope
project.cpp:2192: error: 'fprintf' was not declared in this scope
project.cpp:2201: error: 'stderr' was not declared in this scope
project.cpp:2202: error: 'fprintf' was not declared in this scope
project.cpp:2216: error: 'stderr' was not declared in this scope
project.cpp:2217: error: 'fprintf' was not declared in this scope
project.cpp:2233: error: 'stderr' was not declared in this scope
project.cpp:2234: error: 'fprintf' was not declared in this scope
project.cpp:2238: error: 'system' was not declared in this scope
project.cpp:2242: error: 'stderr' was not declared in this scope
project.cpp:2243: error: 'fprintf' was not declared in this scope
project.cpp:2257: error: 'stderr' was not declared in this scope
project.cpp:2258: error: 'fprintf' was not declared in this scope
project.cpp:2264: error: 'stderr' was not declared in this scope
project.cpp:2265: error: 'fprintf' was not declared in this scope
project.cpp:2269: error: 'stderr' was not declared in this scope
project.cpp:2270: error: 'fprintf' was not declared in this scope
project.cpp:2277: error: 'stderr' was not declared in this scope
project.cpp:2279: error: 'fprintf' was not declared in this scope
project.cpp:2288: error: 'stderr' was not declared in this scope
project.cpp:2289: error: 'fprintf' was not declared in this scope
project.cpp: In member function 'QMakeProject::IncludeStatus QMakeProject::doProjectInclude(QString, uchar, QMap<QString, QStringList>&)':
project.cpp:1523: error: 'stderr' was not declared in this scope
project.cpp:1525: error: 'fprintf' was not declared in this scope
project.cpp:2313: error: 'stderr' was not declared in this scopeproject.cpp:1533: error: 'stderr' was not declared in this scope
project.cpp:2314: error: 'fprintf' was not declared in this scope

project.cpp:1533: error: 'fprintf' was not declared in this scope
project.cpp:2345: error: 'stderr' was not declared in this scope
project.cpp:2346: error: 'fprintf' was not declared in this scope
project.cpp:2361: error: 'stderr' was not declared in this scope
project.cpp:2362: error: 'fprintf' was not declared in this scope
project.cpp:2368: error: 'stderr' was not declared in this scope
project.cpp:2369: error: 'fprintf' was not declared in this scope
project.cpp:2388: error: 'stderr' was not declared in this scope
project.cpp:2389: error: 'fprintf' was not declared in this scope
project.cpp: In member function 'QStringList QMakeProject::doProjectExpand(QString, QList<QStringList>, QMap<QString, QStringList>&)':
project.cpp:1657: error: 'stderr' was not declared in this scope
project.cpp:1658: error: 'fprintf' was not declared in this scope
project.cpp:1676: error: 'stderr' was not declared in this scope
project.cpp:1678: error: 'fprintf' was not declared in this scope
project.cpp:1684: error: 'stderr' was not declared in this scope
project.cpp:2427: error: 'printf' was not declared in this scope
project.cpp:2432: error: 'exit' was not declared in this scope
project.cpp:1686: error: 'fprintf' was not declared in this scope
project.cpp:2440: error: 'stderr' was not declared in this scope
project.cpp:2441: error: 'fprintf' was not declared in this scope
project.cpp:1709: error: 'stderr' was not declared in this scope
project.cpp:1710: error: 'fprintf' was not declared in this scope
project.cpp:2449: error: 'stderr' was not declared in this scope
project.cpp:2450: error: 'fprintf' was not declared in this scope
project.cpp:2454: error: 'stderr' was not declared in this scope
project.cpp:2454: error: 'fprintf' was not declared in this scope
project.cpp:2459: error: 'exit' was not declared in this scope
project.cpp:2463: error: 'stderr' was not declared in this scope
project.cpp:2464: error: 'fprintf' was not declared in this scope
project.cpp:1723: error: 'stderr' was not declared in this scope
project.cpp:1724: error: 'fprintf' was not declared in this scope
project.cpp:1747: error: 'stderr' was not declared in this scope
project.cpp:1748: error: 'fprintf' was not declared in this scope
project.cpp:1769: error: 'stderr' was not declared in this scope
project.cpp:1770: error: 'fprintf' was not declared in this scope
project.cpp:1780: error: 'stderr' was not declared in this scope
project.cpp:1781: error: 'fprintf' was not declared in this scope
project.cpp:1800: error: 'stderr' was not declared in this scope
project.cpp:1801: error: 'fprintf' was not declared in this scope
project.cpp:1811: error: 'stderr' was not declared in this scope
project.cpp:1812: error: 'fprintf' was not declared in this scope
project.cpp:1828: error: 'stderr' was not declared in this scope
project.cpp:1829: error: 'fprintf' was not declared in this scope
project.cpp:1850: error: 'stderr' was not declared in this scope
project.cpp:1851: error: 'fprintf' was not declared in this scope
project.cpp:1861: error: 'stderr' was not declared in this scope
project.cpp:1862: error: 'fprintf' was not declared in this scope
project.cpp:1886: error: 'stderr' was not declared in this scope
project.cpp:1887: error: 'fprintf' was not declared in this scope
project.cpp:1900: error: 'stderr' was not declared in this scope
project.cpp:1901: error: 'fprintf' was not declared in this scope
project.cpp:1906: error: 'FILE' was not declared in this scope
project.cpp:1906: error: 'proc' was not declared in this scope
project.cpp:1906: error: 'popen' was not declared in this scope
project.cpp:1911: error: 'feof' was not declared in this scope
project.cpp:1912: error: 'fread' was not declared in this scope
project.cpp:1927: error: 'stderr' was not declared in this scope
project.cpp:1928: error: 'fprintf' was not declared in this scope
project.cpp:1961: error: 'memcpy' was not declared in this scope
project.cpp:1987: error: 'stderr' was not declared in this scope
project.cpp:1988: error: 'fprintf' was not declared in this scope
project.cpp:2026: error: 'stderr' was not declared in this scope
project.cpp:2027: error: 'fprintf' was not declared in this scope
project.cpp:2029: error: 'stderr' was not declared in this scope
project.cpp:2030: error: 'fprintf' was not declared in this scope
project.cpp:2035: error: 'stderr' was not declared in this scope
project.cpp:2036: error: 'fprintf' was not declared in this scope
project.cpp:2039: error: 'stdin' was not declared in this scope
project.cpp:2047: error: 'stderr' was not declared in this scope
project.cpp:2048: error: 'fprintf' was not declared in this scope
project.cpp:2058: error: 'stderr' was not declared in this scope
project.cpp:2060: error: 'fprintf' was not declared in this scope
project.cpp: In member function 'QStringList& QMakeProject::values(const QString&, QMap<QString, QStringList>&)':
project.cpp:2827: error: aggregate 'utsname name' has incomplete type and cannot be defined
project.cpp:2828: error: 'uname' was not declared in this scope
project.cpp: In member function 'bool QMakeProject::doProjectTest(QString, QList<QStringList>, QMap<QString, QStringList>&)':
project.cpp:2103: error: 'stderr' was not declared in this scope
project.cpp:2106: error: 'fprintf' was not declared in this scope
project.cpp:2122: error: 'stderr' was not declared in this scope
project.cpp:2123: error: 'fprintf' was not declared in this scope
project.cpp:2142: error: 'stderr' was not declared in this scope
project.cpp:2143: error: 'fprintf' was not declared in this scope
project.cpp:2149: error: 'stderr' was not declared in this scope
project.cpp:2150: error: 'fprintf' was not declared in this scope
project.cpp:2168: error: 'stderr' was not declared in this scope
project.cpp:2169: error: 'fprintf' was not declared in this scope
project.cpp:2181: error: 'stderr' was not declared in this scope
project.cpp:2182: error: 'fprintf' was not declared in this scope
project.cpp:2191: error: 'stderr' was not declared in this scope
project.cpp:2192: error: 'fprintf' was not declared in this scope
project.cpp:2201: error: 'stderr' was not declared in this scope
project.cpp:2202: error: 'fprintf' was not declared in this scope
project.cpp:2216: error: 'stderr' was not declared in this scope
project.cpp:2217: error: 'fprintf' was not declared in this scope
project.cpp:2233: error: 'stderr' was not declared in this scope
project.cpp:2234: error: 'fprintf' was not declared in this scope
project.cpp:2238: error: 'system' was not declared in this scope
project.cpp:2242: error: 'stderr' was not declared in this scope
project.cpp:2243: error: 'fprintf' was not declared in this scope
project.cpp:2257: error: 'stderr' was not declared in this scope
project.cpp:2258: error: 'fprintf' was not declared in this scope
project.cpp:2264: error: 'stderr' was not declared in this scope
project.cpp:2265: error: 'fprintf' was not declared in this scope
project.cpp:2269: error: 'stderr' was not declared in this scope
project.cpp:2270: error: 'fprintf' was not declared in this scope
project.cpp:2277: error: 'stderr' was not declared in this scope
project.cpp:2279: error: 'fprintf' was not declared in this scope
project.cpp:2288: error: 'stderr' was not declared in this scope
project.cpp:2289: error: 'fprintf' was not declared in this scope
project.cpp:2313: error: 'stderr' was not declared in this scope
project.cpp:2314: error: 'fprintf' was not declared in this scope
project.cpp:2345: error: 'stderr' was not declared in this scope
project.cpp:2346: error: 'fprintf' was not declared in this scope
project.cpp:2361: error: 'stderr' was not declared in this scope
project.cpp:2362: error: 'fprintf' was not declared in this scope
project.cpp:2368: error: 'stderr' was not declared in this scope
project.cpp:2369: error: 'fprintf' was not declared in this scope
project.cpp:2388: error: 'stderr' was not declared in this scope
project.cpp:2389: error: 'fprintf' was not declared in this scope
project.cpp:2427: error: 'printf' was not declared in this scope
project.cpp:2432: error: 'exit' was not declared in this scope
project.cpp:2440: error: 'stderr' was not declared in this scope
project.cpp:2441: error: 'fprintf' was not declared in this scope
project.cpp:2449: error: 'stderr' was not declared in this scope
project.cpp:2450: error: 'fprintf' was not declared in this scope
project.cpp:2454: error: 'stderr' was not declared in this scope
project.cpp:2454: error: 'fprintf' was not declared in this scope
project.cpp:2459: error: 'exit' was not declared in this scope
project.cpp:2463: error: 'stderr' was not declared in this scope
project.cpp:2464: error: 'fprintf' was not declared in this scope
/Users/williekamin/Desktop/qt-mac-opensource-src-4.2.2/include/QtCore/../../src/corelib/tools/qlist.h: In member function 'void QList<T>::node_construct(QList<T>::Node*, const T&) [with T = QString]':
/Users/williekamin/Desktop/qt-mac-opensource-src-4.2.2/include/QtCore/../../src/corelib/tools/qlist.h:401: instantiated from 'void QList<T>::append(const T&) [with T = QString]'
/Users/williekamin/Desktop/qt-mac-opensource-src-4.2.2/include/QtCore/../../src/corelib/tools/qstringlist.h:50: instantiated from here
/Users/williekamin/Desktop/qt-mac-opensource-src-4.2.2/include/QtCore/../../src/corelib/tools/qlist.h:315: error: no matching function for call to 'operator new(long unsigned int, QList<QString>::Node*&)'
<built-in>:0: note: candidates are: void* operator new(long unsigned int)
/Users/williekamin/Desktop/qt-mac-opensource-src-4.2.2/include/QtCore/../../src/corelib/tools/qlist.h: In member function 'void QList<T>::node_copy(QList<T>::Node*, QList<T>::Node*, QList<T>::Node*) [with T = QString]':
/Users/williekamin/Desktop/qt-mac-opensource-src-4.2.2/include/QtCore/../../src/corelib/tools/qlist.h:584: instantiated from 'QList<T>& QList<T>::operator+=(const QList<T>&) [with T = QString]'
/Users/williekamin/Desktop/qt-mac-opensource-src-4.2.2/include/QtCore/../../src/corelib/tools/qstringlist.h:64: instantiated from here
/Users/williekamin/Desktop/qt-mac-opensource-src-4.2.2/include/QtCore/../../src/corelib/tools/qlist.h:334: error: no matching function for call to 'operator new(long unsigned int, QList<QString>::Node*)'
<built-in>:0: note: candidates are: void* operator new(long unsigned int)
project.cpp: In member function 'QStringList& QMakeProject::values(const QString&, QMap<QString, QStringList>&)':
project.cpp:2827: error: aggregate 'utsname name' has incomplete type and cannot be defined
project.cpp:2828: error: 'uname' was not declared in this scope
/Users/williekamin/Desktop/qt-mac-opensource-src-4.2.2/include/QtCore/../../src/corelib/tools/qvector.h: In member function 'void QVector<T>::append(const T&) [with T = char]':
/Users/williekamin/Desktop/qt-mac-opensource-src-4.2.2/include/QtCore/../../src/corelib/tools/qstack.h:39: instantiated from 'void QStack<T>::push(const T&) [with T = char]'
project.cpp:193: instantiated from here
/Users/williekamin/Desktop/qt-mac-opensource-src-4.2.2/include/QtCore/../../src/corelib/tools/qvector.h:479: error: no matching function for call to 'operator new(long unsigned int, char*)'
<built-in>:0: note: candidates are: void* operator new(long unsigned int)
/Users/williekamin/Desktop/qt-mac-opensource-src-4.2.2/include/QtCore/../../src/corelib/tools/qmap.h: In member function 'QMapData::Node* QMap<Key, T>::node_create(QMapData*, QMapData::Node**, const Key&, const T&) [with Key = QString, T = QStringList]':
/Users/williekamin/Desktop/qt-mac-opensource-src-4.2.2/include/QtCore/../../src/corelib/tools/qmap.h:468: instantiated from 'T& QMap<Key, T>::operator[](const Key&) [with Key = QString, T = QStringList]'
project.cpp:287: instantiated from here
/Users/williekamin/Desktop/qt-mac-opensource-src-4.2.2/include/QtCore/../../src/corelib/tools/qmap.h:409: error: no matching function for call to 'operator new(long unsigned int, QString*)'
<built-in>:0: note: candidates are: void* operator new(long unsigned int)
/Users/williekamin/Desktop/qt-mac-opensource-src-4.2.2/include/QtCore/../../src/corelib/tools/qmap.h:410: error: no matching function for call to 'operator new(long unsigned int, QStringList*)'
<built-in>:0: note: candidates are: void* operator new(long unsigned int)
/Users/williekamin/Desktop/qt-mac-opensource-src-4.2.2/include/QtCore/../../src/corelib/tools/qvector.h: In member function 'void QVector<T>::append(const T&) [with T = QMakeProject::ScopeBlock]':
/Users/williekamin/Desktop/qt-mac-opensource-src-4.2.2/include/QtCore/../../src/corelib/tools/qstack.h:39: instantiated from 'void QStack<T>::push(const T&) [with T = QMakeProject::ScopeBlock]'
project.cpp:561: instantiated from here
/Users/williekamin/Desktop/qt-mac-opensource-src-4.2.2/include/QtCore/../../src/corelib/tools/qvector.h:479: error: no matching function for call to 'operator new(long unsigned int, QMakeProject::ScopeBlock*)'
<built-in>:0: note: candidates are: void* operator new(long unsigned int)
/Users/williekamin/Desktop/qt-mac-opensource-src-4.2.2/include/QtCore/../../src/corelib/tools/qlist.h: In member function 'void QList<T>::node_construct(QList<T>::Node*, const T&) [with T = ParsableBlock::Parse]':
/Users/williekamin/Desktop/qt-mac-opensource-src-4.2.2/include/QtCore/../../src/corelib/tools/qlist.h:401: instantiated from 'void QList<T>::append(const T&) [with T = ParsableBlock::Parse]'
project.cpp:628: instantiated from here
/Users/williekamin/Desktop/qt-mac-opensource-src-4.2.2/include/QtCore/../../src/corelib/tools/qlist.h:315: error: no matching function for call to 'operator new(long unsigned int, QList<ParsableBlock::Parse>::Node*&)'
<built-in>:0: note: candidates are: void* operator new(long unsigned int)
/Users/williekamin/Desktop/qt-mac-opensource-src-4.2.2/include/QtCore/../../src/corelib/tools/qlist.h: In member function 'void QList<T>::node_construct(QList<T>::Node*, const T&) [with T = IteratorBlock::Test]':
/Users/williekamin/Desktop/qt-mac-opensource-src-4.2.2/include/QtCore/../../src/corelib/tools/qlist.h:401: instantiated from 'void QList<T>::append(const T&) [with T = IteratorBlock::Test]'
project.cpp:806: instantiated from here
/Users/williekamin/Desktop/qt-mac-opensource-src-4.2.2/include/QtCore/../../src/corelib/tools/qlist.h:315: error: no matching function for call to 'operator new(long unsigned int, QList<IteratorBlock::Test>::Node*&)'
<built-in>:0: note: candidates are: void* operator new(long unsigned int)
/Users/williekamin/Desktop/qt-mac-opensource-src-4.2.2/include/QtCore/../../src/corelib/tools/qmap.h: In member function 'QMapData::Node* QMap<Key, T>::node_create(QMapData*, QMapData::Node**, const Key&, const T&) [with Key = QString, T = FunctionBlock*]':
/Users/williekamin/Desktop/qt-mac-opensource-src-4.2.2/include/QtCore/../../src/corelib/tools/qmap.h:501: instantiated from 'typename QMap<Key, T>::iterator QMap<Key, T>::insert(const Key&, const T&) [with Key = QString, T = FunctionBlock*]'
project.cpp:831: instantiated from here
/Users/williekamin/Desktop/qt-mac-opensource-src-4.2.2/include/QtCore/../../src/corelib/tools/qmap.h:409: error: no matching function for call to 'operator new(long unsigned int, QString*)'
<built-in>:0: note: candidates are: void* operator new(long unsigned int)
/Users/williekamin/Desktop/qt-mac-opensource-src-4.2.2/include/QtCore/../../src/corelib/tools/qmap.h:410: error: no matching function for call to 'operator new(long unsigned int, FunctionBlock**)'
<built-in>:0: note: candidates are: void* operator new(long unsigned int)
/Users/williekamin/Desktop/qt-mac-opensource-src-4.2.2/include/QtCore/../../src/corelib/tools/qhash.h: In member function 'typename QHash<Key, T>::Node* QHash<Key, T>::createNode(uint, const Key&, const T&, QHashNode<Key, T>**) [with Key = QString, T = bool]':
/Users/williekamin/Desktop/qt-mac-opensource-src-4.2.2/include/QtCore/../../src/corelib/tools/qhash.h:689: instantiated from 'typename QHash<Key, T>::iterator QHash<Key, T>::insert(const Key&, const T&) [with Key = QString, T = bool]'
project.cpp:1331: instantiated from here
/Users/williekamin/Desktop/qt-mac-opensource-src-4.2.2/include/QtCore/../../src/corelib/tools/qhash.h:471: error: no matching function for call to 'operator new(long unsigned int, void*)'
<built-in>:0: note: candidates are: void* operator new(long unsigned int)
/Users/williekamin/Desktop/qt-mac-opensource-src-4.2.2/include/QtCore/../../src/corelib/tools/qhash.h:473: error: no matching function for call to 'operator new(long unsigned int, void*)'
<built-in>:0: note: candidates are: void* operator new(long unsigned int)
/Users/williekamin/Desktop/qt-mac-opensource-src-4.2.2/include/QtCore/../../src/corelib/tools/qvector.h: In member function 'void QVector<T>::append(const T&) [with T = FunctionBlock*]':
/Users/williekamin/Desktop/qt-mac-opensource-src-4.2.2/include/QtCore/../../src/corelib/tools/qstack.h:39: instantiated from 'void QStack<T>::push(const T&) [with T = FunctionBlock*]'
project.cpp:1604: instantiated from here
/Users/williekamin/Desktop/qt-mac-opensource-src-4.2.2/include/QtCore/../../src/corelib/tools/qvector.h:479: error: no matching function for call to 'operator new(long unsigned int, FunctionBlock**)'
<built-in>:0: note: candidates are: void* operator new(long unsigned int)
/Users/williekamin/Desktop/qt-mac-opensource-src-4.2.2/include/QtCore/../../src/corelib/tools/qmap.h: In member function 'QMapData::Node* QMap<Key, T>::node_create(QMapData*, QMapData::Node**, const Key&, const T&) [with Key = QString, T = int]':
/Users/williekamin/Desktop/qt-mac-opensource-src-4.2.2/include/QtCore/../../src/corelib/tools/qmap.h:501: instantiated from 'typename QMap<Key, T>::iterator QMap<Key, T>::insert(const Key&, const T&) [with Key = QString, T = int]'
project.cpp:1624: instantiated from here
/Users/williekamin/Desktop/qt-mac-opensource-src-4.2.2/include/QtCore/../../src/corelib/tools/qmap.h:409: error: no matching function for call to 'operator new(long unsigned int, QString*)'
<built-in>:0: note: candidates are: void* operator new(long unsigned int)
/Users/williekamin/Desktop/qt-mac-opensource-src-4.2.2/include/QtCore/../../src/corelib/tools/qmap.h:410: error: no matching function for call to 'operator new(long unsigned int, int*)'
<built-in>:0: note: candidates are: void* operator new(long unsigned int)
/Users/williekamin/Desktop/qt-mac-opensource-src-4.2.2/include/QtCore/../../src/corelib/tools/qvector.h: In member function 'void QVector<T>::realloc(int, int) [with T = char]':
/Users/williekamin/Desktop/qt-mac-opensource-src-4.2.2/include/QtCore/../../src/corelib/tools/qvector.h:274: instantiated from 'void QVector<T>::resize(int) [with T = char]'
/Users/williekamin/Desktop/qt-mac-opensource-src-4.2.2/include/QtCore/../../src/corelib/tools/qstack.h:48: instantiated from 'T QStack<T>::pop() [with T = char]'
project.cpp:191: instantiated from here
/Users/williekamin/Desktop/qt-mac-opensource-src-4.2.2/include/QtCore/../../src/corelib/tools/qvector.h:396: error: no matching function for call to 'operator new(long unsigned int, char*&)'
<built-in>:0: note: candidates are: void* operator new(long unsigned int)
/Users/williekamin/Desktop/qt-mac-opensource-src-4.2.2/include/QtCore/../../src/corelib/tools/qvector.h:274: instantiated from 'void QVector<T>::resize(int) [with T = char]'
/Users/williekamin/Desktop/qt-mac-opensource-src-4.2.2/include/QtCore/../../src/corelib/tools/qstack.h:48: instantiated from 'T QStack<T>::pop() [with T = char]'
project.cpp:191: instantiated from here
/Users/williekamin/Desktop/qt-mac-opensource-src-4.2.2/include/QtCore/../../src/corelib/tools/qvector.h:435: error: no matching function for call to 'operator new(long unsigned int, char*&)'
<built-in>:0: note: candidates are: void* operator new(long unsigned int)
/Users/williekamin/Desktop/qt-mac-opensource-src-4.2.2/include/QtCore/../../src/corelib/tools/qvector.h:442: error: no matching function for call to 'operator new(long unsigned int, char*&)'
<built-in>:0: note: candidates are: void* operator new(long unsigned int)
/Users/williekamin/Desktop/qt-mac-opensource-src-4.2.2/include/QtCore/../../src/corelib/tools/qvector.h: In member function 'void QVector<T>::realloc(int, int) [with T = QMakeProject::ScopeBlock]':
/Users/williekamin/Desktop/qt-mac-opensource-src-4.2.2/include/QtCore/../../src/corelib/tools/qvector.h:274: instantiated from 'void QVector<T>::resize(int) [with T = QMakeProject::ScopeBlock]'
/Users/williekamin/Desktop/qt-mac-opensource-src-4.2.2/include/QtCore/../../src/corelib/tools/qstack.h:48: instantiated from 'T QStack<T>::pop() [with T = QMakeProject::ScopeBlock]'
project.cpp:248: instantiated from here
/Users/williekamin/Desktop/qt-mac-opensource-src-4.2.2/include/QtCore/../../src/corelib/tools/qvector.h:396: error: no matching function for call to 'operator new(long unsigned int, QMakeProject::ScopeBlock*&)'
<built-in>:0: note: candidates are: void* operator new(long unsigned int)
/Users/williekamin/Desktop/qt-mac-opensource-src-4.2.2/include/QtCore/../../src/corelib/tools/qvector.h:274: instantiated from 'void QVector<T>::resize(int) [with T = QMakeProject::ScopeBlock]'
/Users/williekamin/Desktop/qt-mac-opensource-src-4.2.2/include/QtCore/../../src/corelib/tools/qstack.h:48: instantiated from 'T QStack<T>::pop() [with T = QMakeProject::ScopeBlock]'
project.cpp:248: instantiated from here
/Users/williekamin/Desktop/qt-mac-opensource-src-4.2.2/include/QtCore/../../src/corelib/tools/qvector.h:435: error: no matching function for call to 'operator new(long unsigned int, QMakeProject::ScopeBlock*&)'
<built-in>:0: note: candidates are: void* operator new(long unsigned int)
/Users/williekamin/Desktop/qt-mac-opensource-src-4.2.2/include/QtCore/../../src/corelib/tools/qvector.h:442: error: no matching function for call to 'operator new(long unsigned int, QMakeProject::ScopeBlock*&)'
<built-in>:0: note: candidates are: void* operator new(long unsigned int)
/Users/williekamin/Desktop/qt-mac-opensource-src-4.2.2/include/QtCore/../../src/corelib/tools/qlist.h: In member function 'void QList<T>::node_construct(QList<T>::Node*, const T&) [with T = QStringList]':
/Users/williekamin/Desktop/qt-mac-opensource-src-4.2.2/include/QtCore/../../src/corelib/tools/qlist.h:401: instantiated from 'void QList<T>::append(const T&) [with T = QStringList]'
/Users/williekamin/Desktop/qt-mac-opensource-src-4.2.2/include/QtCore/../../src/corelib/tools/qlist.h:276: instantiated from 'QList<T>& QList<T>::operator+=(const T&) [with T = QStringList]'
project.cpp:1592: instantiated from here
/Users/williekamin/Desktop/qt-mac-opensource-src-4.2.2/include/QtCore/../../src/corelib/tools/qlist.h:315: error: no matching function for call to 'operator new(long unsigned int, QList<QStringList>::Node*&)'
<built-in>:0: note: candidates are: void* operator new(long unsigned int)
/Users/williekamin/Desktop/qt-mac-opensource-src-4.2.2/include/QtCore/../../src/corelib/tools/qlist.h: In member function 'void QList<T>::node_copy(QList<T>::Node*, QList<T>::Node*, QList<T>::Node*) [with T = QStringList]':
/Users/williekamin/Desktop/qt-mac-opensource-src-4.2.2/include/QtCore/../../src/corelib/tools/qlist.h:501: instantiated from 'void QList<T>::detach_helper() [with T = QStringList]'
/Users/williekamin/Desktop/qt-mac-opensource-src-4.2.2/include/QtCore/../../src/corelib/tools/qlist.h:90: instantiated from 'QList<T>::QList(const QList<T>&) [with T = QStringList]'
project.cpp:1594: instantiated from here
/Users/williekamin/Desktop/qt-mac-opensource-src-4.2.2/include/QtCore/../../src/corelib/tools/qlist.h:334: error: no matching function for call to 'operator new(long unsigned int, QList<QStringList>::Node*)'
<built-in>:0: note: candidates are: void* operator new(long unsigned int)
/Users/williekamin/Desktop/qt-mac-opensource-src-4.2.2/include/QtCore/../../src/corelib/tools/qvector.h: In member function 'void QVector<T>::realloc(int, int) [with T = FunctionBlock*]':
/Users/williekamin/Desktop/qt-mac-opensource-src-4.2.2/include/QtCore/../../src/corelib/tools/qvector.h:476: instantiated from 'void QVector<T>::append(const T&) [with T = FunctionBlock*]'
/Users/williekamin/Desktop/qt-mac-opensource-src-4.2.2/include/QtCore/../../src/corelib/tools/qstack.h:39: instantiated from 'void QStack<T>::push(const T&) [with T = FunctionBlock*]'
project.cpp:1604: instantiated from here
/Users/williekamin/Desktop/qt-mac-opensource-src-4.2.2/include/QtCore/../../src/corelib/tools/qvector.h:396: error: no matching function for call to 'operator new(long unsigned int, FunctionBlock**&)'
<built-in>:0: note: candidates are: void* operator new(long unsigned int)
/Users/williekamin/Desktop/qt-mac-opensource-src-4.2.2/include/QtCore/../../src/corelib/tools/qvector.h:476: instantiated from 'void QVector<T>::append(const T&) [with T = FunctionBlock*]'
/Users/williekamin/Desktop/qt-mac-opensource-src-4.2.2/include/QtCore/../../src/corelib/tools/qstack.h:39: instantiated from 'void QStack<T>::push(const T&) [with T = FunctionBlock*]'
project.cpp:1604: instantiated from here
/Users/williekamin/Desktop/qt-mac-opensource-src-4.2.2/include/QtCore/../../src/corelib/tools/qvector.h:435: error: no matching function for call to 'operator new(long unsigned int, FunctionBlock**&)'
<built-in>:0: note: candidates are: void* operator new(long unsigned int)
/Users/williekamin/Desktop/qt-mac-opensource-src-4.2.2/include/QtCore/../../src/corelib/tools/qvector.h:442: error: no matching function for call to 'operator new(long unsigned int, FunctionBlock**&)'
<built-in>:0: note: candidates are: void* operator new(long unsigned int)
/Users/williekamin/Desktop/qt-mac-opensource-src-4.2.2/include/QtCore/../../src/corelib/tools/qlist.h: In member function 'void QList<T>::node_copy(QList<T>::Node*, QList<T>::Node*, QList<T>::Node*) [with T = IteratorBlock::Test]':
/Users/williekamin/Desktop/qt-mac-opensource-src-4.2.2/include/QtCore/../../src/corelib/tools/qlist.h:501: instantiated from 'void QList<T>::detach_helper() [with T = IteratorBlock::Test]'
/Users/williekamin/Desktop/qt-mac-opensource-src-4.2.2/include/QtCore/../../src/corelib/tools/qlist.h:98: instantiated from 'void QList<T>::detach() [with T = IteratorBlock::Test]'
/Users/williekamin/Desktop/qt-mac-opensource-src-4.2.2/include/QtCore/../../src/corelib/tools/qlist.h:214: instantiated from 'QList<T>::iterator QList<T>::begin() [with T = IteratorBlock::Test]'
project.cpp:356: instantiated from here
/Users/williekamin/Desktop/qt-mac-opensource-src-4.2.2/include/QtCore/../../src/corelib/tools/qlist.h:334: error: no matching function for call to 'operator new(long unsigned int, QList<IteratorBlock::Test>::Node*)'
<built-in>:0: note: candidates are: void* operator new(long unsigned int)
/Users/williekamin/Desktop/qt-mac-opensource-src-4.2.2/include/QtCore/../../src/corelib/tools/qlist.h: In member function 'void QList<T>::node_copy(QList<T>::Node*, QList<T>::Node*, QList<T>::Node*) [with T = ParsableBlock::Parse]':
/Users/williekamin/Desktop/qt-mac-opensource-src-4.2.2/include/QtCore/../../src/corelib/tools/qlist.h:501: instantiated from 'void QList<T>::detach_helper() [with T = ParsableBlock::Parse]'
/Users/williekamin/Desktop/qt-mac-opensource-src-4.2.2/include/QtCore/../../src/corelib/tools/qlist.h:98: instantiated from 'void QList<T>::detach() [with T = ParsableBlock::Parse]'
/Users/williekamin/Desktop/qt-mac-opensource-src-4.2.2/include/QtCore/../../src/corelib/tools/qlist.h:399: instantiated from 'void QList<T>::append(const T&) [with T = ParsableBlock::Parse]'
project.cpp:628: instantiated from here
/Users/williekamin/Desktop/qt-mac-opensource-src-4.2.2/include/QtCore/../../src/corelib/tools/qlist.h:334: error: no matching function for call to 'operator new(long unsigned int, QList<ParsableBlock::Parse>::Node*)'
<built-in>:0: note: candidates are: void* operator new(long unsigned int)
/Users/williekamin/Desktop/qt-mac-opensource-src-4.2.2/include/QtCore/../../src/corelib/tools/qhash.h: In static member function 'static void QHash<Key, T>::duplicateNode(QHashData::Node*, void*) [with Key = QString, T = bool]':
/Users/williekamin/Desktop/qt-mac-opensource-src-4.2.2/include/QtCore/../../src/corelib/tools/qhash.h:522: instantiated from 'void QHash<Key, T>::detach_helper() [with Key = QString, T = bool]'
/Users/williekamin/Desktop/qt-mac-opensource-src-4.2.2/include/QtCore/../../src/corelib/tools/qhash.h:241: instantiated from 'void QHash<Key, T>::detach() [with Key = QString, T = bool]'
/Users/williekamin/Desktop/qt-mac-opensource-src-4.2.2/include/QtCore/../../src/corelib/tools/qhash.h:683: instantiated from 'typename QHash<Key, T>::iterator QHash<Key, T>::insert(const Key&, const T&) [with Key = QString, T = bool]'
project.cpp:1331: instantiated from here
/Users/williekamin/Desktop/qt-mac-opensource-src-4.2.2/include/QtCore/../../src/corelib/tools/qhash.h:458: error: no matching function for call to 'operator new(long unsigned int, void*&)'
<built-in>:0: note: candidates are: void* operator new(long unsigned int)
/Users/williekamin/Desktop/qt-mac-opensource-src-4.2.2/include/QtCore/../../src/corelib/tools/qhash.h:460: error: no matching function for call to 'operator new(long unsigned int, void*&)'
<built-in>:0: note: candidates are: void* operator new(long unsigned int)
/Users/williekamin/Desktop/qt-mac-opensource-src-4.2.2/include/QtCore/../../src/corelib/tools/qlist.h: In member function 'void QList<T>::node_construct(QList<T>::Node*, const T&) [with T = QString]':
/Users/williekamin/Desktop/qt-mac-opensource-src-4.2.2/include/QtCore/../../src/corelib/tools/qlist.h:401: instantiated from 'void QList<T>::append(const T&) [with T = QString]'
/Users/williekamin/Desktop/qt-mac-opensource-src-4.2.2/include/QtCore/../../src/corelib/tools/qstringlist.h:50: instantiated from here
/Users/williekamin/Desktop/qt-mac-opensource-src-4.2.2/include/QtCore/../../src/corelib/tools/qlist.h:315: error: no matching function for call to 'operator new(long unsigned int, QList<QString>::Node*&)'
<built-in>:0: note: candidates are: void* operator new(long unsigned int)
/Users/williekamin/Desktop/qt-mac-opensource-src-4.2.2/include/QtCore/../../src/corelib/tools/qlist.h: In member function 'void QList<T>::node_copy(QList<T>::Node*, QList<T>::Node*, QList<T>::Node*) [with T = QString]':
/Users/williekamin/Desktop/qt-mac-opensource-src-4.2.2/include/QtCore/../../src/corelib/tools/qlist.h:584: instantiated from 'QList<T>& QList<T>::operator+=(const QList<T>&) [with T = QString]'
/Users/williekamin/Desktop/qt-mac-opensource-src-4.2.2/include/QtCore/../../src/corelib/tools/qstringlist.h:64: instantiated from here
/Users/williekamin/Desktop/qt-mac-opensource-src-4.2.2/include/QtCore/../../src/corelib/tools/qlist.h:334: error: no matching function for call to 'operator new(long unsigned int, QList<QString>::Node*)'
<built-in>:0: note: candidates are: void* operator new(long unsigned int)
/Users/williekamin/Desktop/qt-mac-opensource-src-4.2.2/include/QtCore/../../src/corelib/tools/qvector.h: In member function 'void QVector<T>::append(const T&) [with T = char]':
/Users/williekamin/Desktop/qt-mac-opensource-src-4.2.2/include/QtCore/../../src/corelib/tools/qstack.h:39: instantiated from 'void QStack<T>::push(const T&) [with T = char]'
project.cpp:193: instantiated from here
/Users/williekamin/Desktop/qt-mac-opensource-src-4.2.2/include/QtCore/../../src/corelib/tools/qvector.h:479: error: no matching function for call to 'operator new(long unsigned int, char*)'
<built-in>:0: note: candidates are: void* operator new(long unsigned int)
/Users/williekamin/Desktop/qt-mac-opensource-src-4.2.2/include/QtCore/../../src/corelib/tools/qmap.h: In member function 'QMapData::Node* QMap<Key, T>::node_create(QMapData*, QMapData::Node**, const Key&, const T&) [with Key = QString, T = QStringList]':
/Users/williekamin/Desktop/qt-mac-opensource-src-4.2.2/include/QtCore/../../src/corelib/tools/qmap.h:468: instantiated from 'T& QMap<Key, T>::operator[](const Key&) [with Key = QString, T = QStringList]'
project.cpp:287: instantiated from here
/Users/williekamin/Desktop/qt-mac-opensource-src-4.2.2/include/QtCore/../../src/corelib/tools/qmap.h:409: error: no matching function for call to 'operator new(long unsigned int, QString*)'
<built-in>:0: note: candidates are: void* operator new(long unsigned int)
/Users/williekamin/Desktop/qt-mac-opensource-src-4.2.2/include/QtCore/../../src/corelib/tools/qmap.h:410: error: no matching function for call to 'operator new(long unsigned int, QStringList*)'
<built-in>:0: note: candidates are: void* operator new(long unsigned int)
/Users/williekamin/Desktop/qt-mac-opensource-src-4.2.2/include/QtCore/../../src/corelib/tools/qvector.h: In member function 'void QVector<T>::append(const T&) [with T = QMakeProject::ScopeBlock]':
/Users/williekamin/Desktop/qt-mac-opensource-src-4.2.2/include/QtCore/../../src/corelib/tools/qstack.h:39: instantiated from 'void QStack<T>::push(const T&) [with T = QMakeProject::ScopeBlock]'
project.cpp:561: instantiated from here
/Users/williekamin/Desktop/qt-mac-opensource-src-4.2.2/include/QtCore/../../src/corelib/tools/qvector.h:479: error: no matching function for call to 'operator new(long unsigned int, QMakeProject::ScopeBlock*)'
<built-in>:0: note: candidates are: void* operator new(long unsigned int)
/Users/williekamin/Desktop/qt-mac-opensource-src-4.2.2/include/QtCore/../../src/corelib/tools/qlist.h: In member function 'void QList<T>::node_construct(QList<T>::Node*, const T&) [with T = ParsableBlock::Parse]':
/Users/williekamin/Desktop/qt-mac-opensource-src-4.2.2/include/QtCore/../../src/corelib/tools/qlist.h:401: instantiated from 'void QList<T>::append(const T&) [with T = ParsableBlock::Parse]'
project.cpp:628: instantiated from here
/Users/williekamin/Desktop/qt-mac-opensource-src-4.2.2/include/QtCore/../../src/corelib/tools/qlist.h:315: error: no matching function for call to 'operator new(long unsigned int, QList<ParsableBlock::Parse>::Node*&)'
<built-in>:0: note: candidates are: void* operator new(long unsigned int)
/Users/williekamin/Desktop/qt-mac-opensource-src-4.2.2/include/QtCore/../../src/corelib/tools/qlist.h: In member function 'void QList<T>::node_construct(QList<T>::Node*, const T&) [with T = IteratorBlock::Test]':
/Users/williekamin/Desktop/qt-mac-opensource-src-4.2.2/include/QtCore/../../src/corelib/tools/qlist.h:401: instantiated from 'void QList<T>::append(const T&) [with T = IteratorBlock::Test]'
project.cpp:806: instantiated from here
/Users/williekamin/Desktop/qt-mac-opensource-src-4.2.2/include/QtCore/../../src/corelib/tools/qlist.h:315: error: no matching function for call to 'operator new(long unsigned int, QList<IteratorBlock::Test>::Node*&)'
<built-in>:0: note: candidates are: void* operator new(long unsigned int)
/Users/williekamin/Desktop/qt-mac-opensource-src-4.2.2/include/QtCore/../../src/corelib/tools/qmap.h: In member function 'QMapData::Node* QMap<Key, T>::node_create(QMapData*, QMapData::Node**, const Key&, const T&) [with Key = QString, T = FunctionBlock*]':
/Users/williekamin/Desktop/qt-mac-opensource-src-4.2.2/include/QtCore/../../src/corelib/tools/qmap.h:501: instantiated from 'typename QMap<Key, T>::iterator QMap<Key, T>::insert(const Key&, const T&) [with Key = QString, T = FunctionBlock*]'
project.cpp:831: instantiated from here
/Users/williekamin/Desktop/qt-mac-opensource-src-4.2.2/include/QtCore/../../src/corelib/tools/qmap.h:409: error: no matching function for call to 'operator new(long unsigned int, QString*)'
<built-in>:0: note: candidates are: void* operator new(long unsigned int)
/Users/williekamin/Desktop/qt-mac-opensource-src-4.2.2/include/QtCore/../../src/corelib/tools/qmap.h:410: error: no matching function for call to 'operator new(long unsigned int, FunctionBlock**)'
<built-in>:0: note: candidates are: void* operator new(long unsigned int)
/Users/williekamin/Desktop/qt-mac-opensource-src-4.2.2/include/QtCore/../../src/corelib/tools/qhash.h: In member function 'typename QHash<Key, T>::Node* QHash<Key, T>::createNode(uint, const Key&, const T&, QHashNode<Key, T>**) [with Key = QString, T = bool]':
/Users/williekamin/Desktop/qt-mac-opensource-src-4.2.2/include/QtCore/../../src/corelib/tools/qhash.h:689: instantiated from 'typename QHash<Key, T>::iterator QHash<Key, T>::insert(const Key&, const T&) [with Key = QString, T = bool]'
project.cpp:1331: instantiated from here
/Users/williekamin/Desktop/qt-mac-opensource-src-4.2.2/include/QtCore/../../src/corelib/tools/qhash.h:471: error: no matching function for call to 'operator new(long unsigned int, void*)'
<built-in>:0: note: candidates are: void* operator new(long unsigned int)
/Users/williekamin/Desktop/qt-mac-opensource-src-4.2.2/include/QtCore/../../src/corelib/tools/qhash.h:473: error: no matching function for call to 'operator new(long unsigned int, void*)'
<built-in>:0: note: candidates are: void* operator new(long unsigned int)
/Users/williekamin/Desktop/qt-mac-opensource-src-4.2.2/include/QtCore/../../src/corelib/tools/qvector.h: In member function 'void QVector<T>::append(const T&) [with T = FunctionBlock*]':
/Users/williekamin/Desktop/qt-mac-opensource-src-4.2.2/include/QtCore/../../src/corelib/tools/qstack.h:39: instantiated from 'void QStack<T>::push(const T&) [with T = FunctionBlock*]'
project.cpp:1604: instantiated from here
/Users/williekamin/Desktop/qt-mac-opensource-src-4.2.2/include/QtCore/../../src/corelib/tools/qvector.h:479: error: no matching function for call to 'operator new(long unsigned int, FunctionBlock**)'
<built-in>:0: note: candidates are: void* operator new(long unsigned int)
/Users/williekamin/Desktop/qt-mac-opensource-src-4.2.2/include/QtCore/../../src/corelib/tools/qmap.h: In member function 'QMapData::Node* QMap<Key, T>::node_create(QMapData*, QMapData::Node**, const Key&, const T&) [with Key = QString, T = int]':
/Users/williekamin/Desktop/qt-mac-opensource-src-4.2.2/include/QtCore/../../src/corelib/tools/qmap.h:501: instantiated from 'typename QMap<Key, T>::iterator QMap<Key, T>::insert(const Key&, const T&) [with Key = QString, T = int]'
project.cpp:1624: instantiated from here
/Users/williekamin/Desktop/qt-mac-opensource-src-4.2.2/include/QtCore/../../src/corelib/tools/qmap.h:409: error: no matching function for call to 'operator new(long unsigned int, QString*)'
<built-in>:0: note: candidates are: void* operator new(long unsigned int)
/Users/williekamin/Desktop/qt-mac-opensource-src-4.2.2/include/QtCore/../../src/corelib/tools/qmap.h:410: error: no matching function for call to 'operator new(long unsigned int, int*)'
<built-in>:0: note: candidates are: void* operator new(long unsigned int)
/Users/williekamin/Desktop/qt-mac-opensource-src-4.2.2/include/QtCore/../../src/corelib/tools/qvector.h: In member function 'void QVector<T>::realloc(int, int) [with T = char]':
/Users/williekamin/Desktop/qt-mac-opensource-src-4.2.2/include/QtCore/../../src/corelib/tools/qvector.h:274: instantiated from 'void QVector<T>::resize(int) [with T = char]'
/Users/williekamin/Desktop/qt-mac-opensource-src-4.2.2/include/QtCore/../../src/corelib/tools/qstack.h:48: instantiated from 'T QStack<T>::pop() [with T = char]'
project.cpp:191: instantiated from here
/Users/williekamin/Desktop/qt-mac-opensource-src-4.2.2/include/QtCore/../../src/corelib/tools/qvector.h:396: error: no matching function for call to 'operator new(long unsigned int, char*&)'
<built-in>:0: note: candidates are: void* operator new(long unsigned int)
/Users/williekamin/Desktop/qt-mac-opensource-src-4.2.2/include/QtCore/../../src/corelib/tools/qvector.h:274: instantiated from 'void QVector<T>::resize(int) [with T = char]'
/Users/williekamin/Desktop/qt-mac-opensource-src-4.2.2/include/QtCore/../../src/corelib/tools/qstack.h:48: instantiated from 'T QStack<T>::pop() [with T = char]'
project.cpp:191: instantiated from here
/Users/williekamin/Desktop/qt-mac-opensource-src-4.2.2/include/QtCore/../../src/corelib/tools/qvector.h:435: error: no matching function for call to 'operator new(long unsigned int, char*&)'
<built-in>:0: note: candidates are: void* operator new(long unsigned int)
/Users/williekamin/Desktop/qt-mac-opensource-src-4.2.2/include/QtCore/../../src/corelib/tools/qvector.h:442: error: no matching function for call to 'operator new(long unsigned int, char*&)'
<built-in>:0: note: candidates are: void* operator new(long unsigned int)
/Users/williekamin/Desktop/qt-mac-opensource-src-4.2.2/include/QtCore/../../src/corelib/tools/qvector.h: In member function 'void QVector<T>::realloc(int, int) [with T = QMakeProject::ScopeBlock]':
/Users/williekamin/Desktop/qt-mac-opensource-src-4.2.2/include/QtCore/../../src/corelib/tools/qvector.h:274: instantiated from 'void QVector<T>::resize(int) [with T = QMakeProject::ScopeBlock]'
/Users/williekamin/Desktop/qt-mac-opensource-src-4.2.2/include/QtCore/../../src/corelib/tools/qstack.h:48: instantiated from 'T QStack<T>::pop() [with T = QMakeProject::ScopeBlock]'
project.cpp:248: instantiated from here
/Users/williekamin/Desktop/qt-mac-opensource-src-4.2.2/include/QtCore/../../src/corelib/tools/qvector.h:396: error: no matching function for call to 'operator new(long unsigned int, QMakeProject::ScopeBlock*&)'
<built-in>:0: note: candidates are: void* operator new(long unsigned int)
/Users/williekamin/Desktop/qt-mac-opensource-src-4.2.2/include/QtCore/../../src/corelib/tools/qvector.h:274: instantiated from 'void QVector<T>::resize(int) [with T = QMakeProject::ScopeBlock]'
/Users/williekamin/Desktop/qt-mac-opensource-src-4.2.2/include/QtCore/../../src/corelib/tools/qstack.h:48: instantiated from 'T QStack<T>::pop() [with T = QMakeProject::ScopeBlock]'
project.cpp:248: instantiated from here
/Users/williekamin/Desktop/qt-mac-opensource-src-4.2.2/include/QtCore/../../src/corelib/tools/qvector.h:435: error: no matching function for call to 'operator new(long unsigned int, QMakeProject::ScopeBlock*&)'
<built-in>:0: note: candidates are: void* operator new(long unsigned int)
/Users/williekamin/Desktop/qt-mac-opensource-src-4.2.2/include/QtCore/../../src/corelib/tools/qvector.h:442: error: no matching function for call to 'operator new(long unsigned int, QMakeProject::ScopeBlock*&)'
<built-in>:0: note: candidates are: void* operator new(long unsigned int)
/Users/williekamin/Desktop/qt-mac-opensource-src-4.2.2/include/QtCore/../../src/corelib/tools/qlist.h: In member function 'void QList<T>::node_construct(QList<T>::Node*, const T&) [with T = QStringList]':
/Users/williekamin/Desktop/qt-mac-opensource-src-4.2.2/include/QtCore/../../src/corelib/tools/qlist.h:401: instantiated from 'void QList<T>::append(const T&) [with T = QStringList]'
/Users/williekamin/Desktop/qt-mac-opensource-src-4.2.2/include/QtCore/../../src/corelib/tools/qlist.h:276: instantiated from 'QList<T>& QList<T>::operator+=(const T&) [with T = QStringList]'
project.cpp:1592: instantiated from here
/Users/williekamin/Desktop/qt-mac-opensource-src-4.2.2/include/QtCore/../../src/corelib/tools/qlist.h:315: error: no matching function for call to 'operator new(long unsigned int, QList<QStringList>::Node*&)'
<built-in>:0: note: candidates are: void* operator new(long unsigned int)
/Users/williekamin/Desktop/qt-mac-opensource-src-4.2.2/include/QtCore/../../src/corelib/tools/qlist.h: In member function 'void QList<T>::node_copy(QList<T>::Node*, QList<T>::Node*, QList<T>::Node*) [with T = QStringList]':
/Users/williekamin/Desktop/qt-mac-opensource-src-4.2.2/include/QtCore/../../src/corelib/tools/qlist.h:501: instantiated from 'void QList<T>::detach_helper() [with T = QStringList]'
/Users/williekamin/Desktop/qt-mac-opensource-src-4.2.2/include/QtCore/../../src/corelib/tools/qlist.h:90: instantiated from 'QList<T>::QList(const QList<T>&) [with T = QStringList]'
project.cpp:1594: instantiated from here
/Users/williekamin/Desktop/qt-mac-opensource-src-4.2.2/include/QtCore/../../src/corelib/tools/qlist.h:334: error: no matching function for call to 'operator new(long unsigned int, QList<QStringList>::Node*)'
<built-in>:0: note: candidates are: void* operator new(long unsigned int)
/Users/williekamin/Desktop/qt-mac-opensource-src-4.2.2/include/QtCore/../../src/corelib/tools/qvector.h: In member function 'void QVector<T>::realloc(int, int) [with T = FunctionBlock*]':
/Users/williekamin/Desktop/qt-mac-opensource-src-4.2.2/include/QtCore/../../src/corelib/tools/qvector.h:476: instantiated from 'void QVector<T>::append(const T&) [with T = FunctionBlock*]'
/Users/williekamin/Desktop/qt-mac-opensource-src-4.2.2/include/QtCore/../../src/corelib/tools/qstack.h:39: instantiated from 'void QStack<T>::push(const T&) [with T = FunctionBlock*]'
project.cpp:1604: instantiated from here
/Users/williekamin/Desktop/qt-mac-opensource-src-4.2.2/include/QtCore/../../src/corelib/tools/qvector.h:396: error: no matching function for call to 'operator new(long unsigned int, FunctionBlock**&)'
<built-in>:0: note: candidates are: void* operator new(long unsigned int)
/Users/williekamin/Desktop/qt-mac-opensource-src-4.2.2/include/QtCore/../../src/corelib/tools/qvector.h:476: instantiated from 'void QVector<T>::append(const T&) [with T = FunctionBlock*]'
/Users/williekamin/Desktop/qt-mac-opensource-src-4.2.2/include/QtCore/../../src/corelib/tools/qstack.h:39: instantiated from 'void QStack<T>::push(const T&) [with T = FunctionBlock*]'
project.cpp:1604: instantiated from here
/Users/williekamin/Desktop/qt-mac-opensource-src-4.2.2/include/QtCore/../../src/corelib/tools/qvector.h:435: error: no matching function for call to 'operator new(long unsigned int, FunctionBlock**&)'
<built-in>:0: note: candidates are: void* operator new(long unsigned int)
/Users/williekamin/Desktop/qt-mac-opensource-src-4.2.2/include/QtCore/../../src/corelib/tools/qvector.h:442: error: no matching function for call to 'operator new(long unsigned int, FunctionBlock**&)'
<built-in>:0: note: candidates are: void* operator new(long unsigned int)
/Users/williekamin/Desktop/qt-mac-opensource-src-4.2.2/include/QtCore/../../src/corelib/tools/qlist.h: In member function 'void QList<T>::node_copy(QList<T>::Node*, QList<T>::Node*, QList<T>::Node*) [with T = IteratorBlock::Test]':
/Users/williekamin/Desktop/qt-mac-opensource-src-4.2.2/include/QtCore/../../src/corelib/tools/qlist.h:501: instantiated from 'void QList<T>::detach_helper() [with T = IteratorBlock::Test]'
/Users/williekamin/Desktop/qt-mac-opensource-src-4.2.2/include/QtCore/../../src/corelib/tools/qlist.h:98: instantiated from 'void QList<T>::detach() [with T = IteratorBlock::Test]'
/Users/williekamin/Desktop/qt-mac-opensource-src-4.2.2/include/QtCore/../../src/corelib/tools/qlist.h:214: instantiated from 'QList<T>::iterator QList<T>::begin() [with T = IteratorBlock::Test]'
project.cpp:356: instantiated from here
/Users/williekamin/Desktop/qt-mac-opensource-src-4.2.2/include/QtCore/../../src/corelib/tools/qlist.h:334: error: no matching function for call to 'operator new(long unsigned int, QList<IteratorBlock::Test>::Node*)'
<built-in>:0: note: candidates are: void* operator new(long unsigned int)
/Users/williekamin/Desktop/qt-mac-opensource-src-4.2.2/include/QtCore/../../src/corelib/tools/qlist.h: In member function 'void QList<T>::node_copy(QList<T>::Node*, QList<T>::Node*, QList<T>::Node*) [with T = ParsableBlock::Parse]':
/Users/williekamin/Desktop/qt-mac-opensource-src-4.2.2/include/QtCore/../../src/corelib/tools/qlist.h:501: instantiated from 'void QList<T>::detach_helper() [with T = ParsableBlock::Parse]'
/Users/williekamin/Desktop/qt-mac-opensource-src-4.2.2/include/QtCore/../../src/corelib/tools/qlist.h:98: instantiated from 'void QList<T>::detach() [with T = ParsableBlock::Parse]'
/Users/williekamin/Desktop/qt-mac-opensource-src-4.2.2/include/QtCore/../../src/corelib/tools/qlist.h:399: instantiated from 'void QList<T>::append(const T&) [with T = ParsableBlock::Parse]'
project.cpp:628: instantiated from here
/Users/williekamin/Desktop/qt-mac-opensource-src-4.2.2/include/QtCore/../../src/corelib/tools/qlist.h:334: error: no matching function for call to 'operator new(long unsigned int, QList<ParsableBlock::Parse>::Node*)'
<built-in>:0: note: candidates are: void* operator new(long unsigned int)
/Users/williekamin/Desktop/qt-mac-opensource-src-4.2.2/include/QtCore/../../src/corelib/tools/qhash.h: In static member function 'static void QHash<Key, T>::duplicateNode(QHashData::Node*, void*) [with Key = QString, T = bool]':
/Users/williekamin/Desktop/qt-mac-opensource-src-4.2.2/include/QtCore/../../src/corelib/tools/qhash.h:522: instantiated from 'void QHash<Key, T>::detach_helper() [with Key = QString, T = bool]'
/Users/williekamin/Desktop/qt-mac-opensource-src-4.2.2/include/QtCore/../../src/corelib/tools/qhash.h:241: instantiated from 'void QHash<Key, T>::detach() [with Key = QString, T = bool]'
/Users/williekamin/Desktop/qt-mac-opensource-src-4.2.2/include/QtCore/../../src/corelib/tools/qhash.h:683: instantiated from 'typename QHash<Key, T>::iterator QHash<Key, T>::insert(const Key&, const T&) [with Key = QString, T = bool]'
project.cpp:1331: instantiated from here
/Users/williekamin/Desktop/qt-mac-opensource-src-4.2.2/include/QtCore/../../src/corelib/tools/qhash.h:458: error: no matching function for call to 'operator new(long unsigned int, void*&)'
<built-in>:0: note: candidates are: void* operator new(long unsigned int)
/Users/williekamin/Desktop/qt-mac-opensource-src-4.2.2/include/QtCore/../../src/corelib/tools/qhash.h:460: error: no matching function for call to 'operator new(long unsigned int, void*&)'
<built-in>:0: note: candidates are: void* operator new(long unsigned int)
lipo: can't open input file: /var/tmp//ccvpjeIM.out (No such file or directory)
make: *** [project.o] Error 1
will-kamins-computer:~/desktop/qt-mac-opensource-src-4.2.2 williekamin$ make
make: *** No targets specified and no makefile found. Stop.