Become a MacRumors Supporter for $50/year with no ads, ability to filter front page stories, and private forums.

chris1981

macrumors member
Original poster
Nov 27, 2013
30
0
Hi,

May be someone knows what those errors means. I tested a MacBook Pro 17", Aluminium, Mid 2009 with a dead battery inside under ASD:

Temp (TB1T) - Battery Thermal Diode 1 temperature (test #1) - Sensor Reads Within Operating Range
- Check to ensure that sensor reads within operating range.
ERROR -- 3 [Sensor reading below low point] -- (0.00) TEST FAILED

Temp (TB2T) - Battery Thermal Diode 2 temperature (test #1) - Sensor Reads Within Operating Range
- Check to ensure that sensor reads within operating range.
ERROR -- 3 [Sensor reading below low point] -- (0.00) TEST FAILED

Temp (TB3T) - Battery temperature (test #1) - Sensor Reads Within Operating Range
- Check to ensure that sensor reads within operating range.
ERROR -- 1 [Unable to read sensor] -- (-1.00) TEST FAILED


All other test passed completely with ASD OS and ASD EFI and I did not find any information about
this thermal diode. Does any of these seat on the logicboard or is it a cable possible to exchange ? I was wondering if I was simply replacing the battery with a new will fix things.

Thanks in advance !!
 
Register on MacRumors! This sidebar will go away, and you'll see fewer ads.