Compiling Wine with macport

Discussion in 'Mac Programming' started by 0ra1, Apr 14, 2010.

  1. 0ra1 macrumors newbie

    Joined:
    Apr 14, 2010
    #1
    Ok here we go:
    i install using macport and porticus
    while im installing it i get error with Xorg-composite so i try and install separately but i get this error now :

    Code:
    $ sudo port install  xorg-libXcomposite +universal
    --->  Computing dependencies for xorg-libXcomposite
    --->  Building xorg-libXcomposite
    Error: Target org.macports.build returned: shell command " cd "/opt/local/var/macports/build/_opt_local_var_macports_sources_rsync.macports.org_release_ports_x11_xorg-libXcomposite/work/libXcomposite-0.4.1" && /usr/bin/make -j2 all " returned error 2
    Command output:       _XCompositeGetOverlayWindow in Xcomposite.o
      "_XFree", referenced from:
          _XCompositeFindDisplay in Xcomposite.o
      "__Xglobal_lock", referenced from:
          __Xglobal_lock$non_lazy_ptr in Xcomposite.o
      "__XUnlockMutex_fn", referenced from:
          __XUnlockMutex_fn$non_lazy_ptr in Xcomposite.o
      "_XESetCloseDisplay", referenced from:
          _XCompositeFindDisplay in Xcomposite.o
          _XCompositeFindDisplay in Xcomposite.o
      "__XFlush", referenced from:
          _XCompositeFindDisplay in Xcomposite.o
          _XCompositeReleaseOverlayWindow in Xcomposite.o
          _XCompositeGetOverlayWindow in Xcomposite.o
          _XCompositeNameWindowPixmap in Xcomposite.o
          _XCompositeCreateRegionFromBorderClip in Xcomposite.o
          _XCompositeUnredirectSubwindows in Xcomposite.o
          _XCompositeUnredirectWindow in Xcomposite.o
          _XCompositeRedirectSubwindows in Xcomposite.o
          _XCompositeRedirectWindow in Xcomposite.o
      "_XInitExtension", referenced from:
          _XCompositeFindDisplay in Xcomposite.o
      "__XLockMutex_fn", referenced from:
          __XLockMutex_fn$non_lazy_ptr in Xcomposite.o
    ld: symbol(s) not found
    collect2: ld returned 1 exit status
    lipo: can't open input file: /var/tmp//cchH1WTa.out (No such file or directory)
    make[2]: *** [libXcomposite.la] Error 1
    make[1]: *** [all-recursive] Error 1
    make: *** [all] Error 2
    
    Error: Status 1 encountered during processing.
    Before reporting a bug, first run the command again with the -d flag to get complete output.
    what im doing wrong?
    i have: Xcode installed
    X11
    and snow leopard 10.6.2
    a intel mac and acces to admin account
    eny help plz?
     
  2. 0ra1 thread starter macrumors newbie

    Joined:
    Apr 14, 2010
    #2
    bump eny one out there can help? want to get aion working!
     

Share This Page