MB late 2008: Help reading a crash report

Discussion in 'MacBook' started by panchoskywalker, Jan 4, 2014.

  1. panchoskywalker macrumors newbie

    Joined:
    Jan 4, 2014
    Location:
    chile
    #1
    My unibody MB late 2008 (non pro) has always crashed whenever he wants, I recentlly knew about crash report and I managed to find a report just afet 2 crashs this afternoon. I'd like to know what is it about before I throw it through the window.

    first crash:

    My MB late 2008 use to crash sometimes, this is the first time I get the crash report, may someone help me to find out what caused the crash? The MB crashed at 19:09

    This is all the info I found at about 19:09, the rest of the info was about 15h, so I guess it must be somewhere here.

    Jan 4 19:09:23 localhost kernel[0]: Darwin Kernel Version 11.4.2: Thu Aug 23 16:25:48 PDT 2012; root:xnu-1699.32.7~1/RELEASE_X86_64
    Jan 4 19:09:23 localhost kernel[0]: vm_page_bootstrap: 1962390 free pages and 52842 wired pages
    Jan 4 19:09:23 localhost kernel[0]: kext submap [0xffffff7f80736000 - 0xffffff8000000000], kernel text [0xffffff8000200000 - 0xffffff8000736000]
    Jan 4 19:09:23 localhost kernel[0]: zone leak detection enabled
    Jan 4 19:09:23 localhost kernel[0]: standard timeslicing quantum is 10000 us
    Jan 4 19:09:23 localhost kernel[0]: mig_table_max_displ = 73
    Jan 4 19:09:23 localhost kernel[0]: AppleACPICPU: ProcessorId=0 LocalApicId=0 Enabled
    Jan 4 19:09:23 localhost kernel[0]: AppleACPICPU: ProcessorId=1 LocalApicId=1 Enabled
    Jan 4 19:09:23 localhost kernel[0]: calling mpo_policy_init for TMSafetyNet
    Jan 4 19:09:23 localhost kernel[0]: Security policy loaded: Safety net for Time Machine (TMSafetyNet)
    Jan 4 19:09:23 localhost kernel[0]: calling mpo_policy_init for Sandbox
    Jan 4 19:09:23 localhost kernel[0]: Security policy loaded: Seatbelt sandbox policy (Sandbox)
    Jan 4 19:09:23 localhost kernel[0]: calling mpo_policy_init for Quarantine
    Jan 4 19:09:23 localhost kernel[0]: Security policy loaded: Quarantine policy (Quarantine)
    Jan 4 19:09:23 localhost kernel[0]: Copyright (c) 1982, 1986, 1989, 1991, 1993
    Jan 4 19:09:23 localhost kernel[0]: The Regents of the University of California. All rights reserved.
    Jan 4 19:09:23 localhost kernel[0]: MAC Framework successfully initialized
    Jan 4 19:09:23 localhost kernel[0]: using 16384 buffer headers and 10240 cluster IO buffer headers
    Jan 4 19:09:23 localhost kernel[0]: IOAPIC: Version 0x11 Vectors 64:87
    Jan 4 19:09:23 localhost kernel[0]: ACPI: System State [S0 S3 S4 S5]
    Jan 4 19:09:23 localhost kernel[0]: PFM64 (36 cpu) 0xf10000000, 0xf0000000
    Jan 4 19:09:23 localhost kernel[0]: [ PCI configuration begin ]
    Jan 4 19:09:23 localhost kernel[0]: console relocated to 0xf10010000
    Jan 4 19:09:23 localhost kernel[0]: PCI configuration changed (bridge=2 device=2 cardbus=0)
    Jan 4 19:09:23 localhost kernel[0]: [ PCI configuration end, bridges 4 devices 17 ]
    Jan 4 19:09:23 localhost kernel[0]: AppleIntelCPUPowerManagement: (built 16:32:09 Aug 23 2012) initialization complete
    Jan 4 19:09:23 localhost kernel[0]: mbinit: done [64 MB total pool size, (42/21) split]
    Jan 4 19:09:23 localhost kernel[0]: Pthread support ABORTS when sync kernel primitives misused
    Jan 4 19:09:23 localhost kernel[0]: com.apple.AppleFSCompressionTypeZlib kmod start
    Jan 4 19:09:23 localhost kernel[0]: com.apple.AppleFSCompressionTypeDataless kmod start
    Jan 4 19:09:23 localhost kernel[0]: com.apple.AppleFSCompressionTypeZlib load succeeded
    Jan 4 19:09:23 localhost kernel[0]: com.apple.AppleFSCompressionTypeDataless load succeeded
    Jan 4 19:09:23 localhost kernel[0]: AppleIntelCPUPowerManagementClient: ready
    Jan 4 19:09:23 localhost kernel[0]: BTCOEXIST off
    Jan 4 19:09:23 localhost kernel[0]: wl0: Broadcom BCM432b 802.11 Wireless Controller
    Jan 4 19:09:23 localhost kernel[0]: 5.106.198.19
    Jan 4 19:09:23 localhost kernel[0]: [IOBluetoothHCIController::setConfigState] calling registerService
    Jan 4 19:09:23 localhost kernel[0]: rooting via boot-uuid from /chosen: 75E558EA-8789-39E9-8865-840E3E32B6F6
    Jan 4 19:09:23 localhost kernel[0]: Waiting on <dict ID="0"><key>IOProviderClass</key><string ID="1">IOResources</string><key>IOResourceMatch</key><string ID="2">boot-uuid-media</string></dict>
    Jan 4 19:09:23 localhost kernel[0]: Got boot device = IOService:/AppleACPIPlatformExpert/PCI0@0/AppleACPIPCI/SATA@B/AppleMCP79AHCI/PRT0@0/IOAHCIDevice@0/AppleAHCIDiskDriver/IOAHCIBlockStorageDevice/IOBlockStorageDriver/FUJITSU MHZ2160BH FFS G1 Media/IOGUIDPartitionScheme/Untitled@2
    Jan 4 19:09:23 localhost kernel[0]: BSD root: disk0s2, major 14, minor 2
    Jan 4 19:09:23 localhost kernel[0]: jnl: unknown-dev: replay_journal: from: 11675136 to: 14739456 (joffset 0x4a8000)
    Jan 4 19:09:23 localhost kernel[0]: jnl: unknown-dev: journal replay done.
    Jan 4 19:09:23 localhost kernel[0]: Kernel is LP64
    Jan 4 19:09:23 localhost kernel[0]: hfs: Removed 70 orphaned / unlinked files and 26 directories
    Jan 4 19:09:29 localhost kernel[0]: Waiting for DSMOS...
    Jan 4 19:09:29 localhost kernel[0]: macx_swapon SUCCESS
    Jan 4 19:09:37 localhost kernel[0]: NVEthernet: Ethernet address 00:23:32:ce:23:84
    Jan 4 19:09:37 localhost kernel[0]: AirPort_Brcm4331: Ethernet address 00:23:6c:84:86:e6
    Jan 4 19:09:37 localhost kernel[0]: IO80211Controller::dataLinkLayerAttachComplete(): adding AppleEFINVRAM notification
    Jan 4 19:09:39 localhost kernel[0]: Previous Shutdown Cause: -1
    Jan 4 19:09:39 localhost kernel[0]: SMC::smcInitHelper ERROR: MMIO regMap == NULL - fall back to old SMC mode
    Jan 4 19:09:39 localhost kernel[0]: NVDANV50HAL loaded and registered.
    Jan 4 19:09:40 localhost kernel[0]: SMC::smcReadKeyAction ERROR: smcReadData8 failed for key MOTP (kSMCKeyNotFound)
    Jan 4 19:09:40 localhost kernel[0]: DSMOS has arrived
    Jan 4 19:09:40 localhost kernel[0]: SMC::smcReadKeyAction ERROR: smcReadData8 failed for key BEMB (kSMCKeyNotFound)
    Jan 4 19:09:55 localhost kernel[0]: in func createVirtualInterface ifRole = 1
    Jan 4 19:09:55 localhost kernel[0]: Created virtif 0xffffff80127bc400 p2p0
    Jan 4 19:09:56 localhost kernel[0]: AirPort: Link Down on en1. Reason 8 (Disassociated because station leaving).
    Jan 4 19:09:56 localhost kernel[0]: 00000000 00000020 NVEthernet::setLinkStatus - not Active
    Jan 4 19:09:58 macbook-de-pancho-skywalker-3 kernel[0]: ast_pending=0xffffff80002af8b0
    Jan 4 19:09:58 macbook-de-pancho-skywalker-3 kernel[0]: cpu_interrupt=0xffffff80002cb890
    Jan 4 19:09:58 macbook-de-pancho-skywalker-3 kernel[0]: vboxdrv: fAsync=0 offMin=0x81d offMax=0xb13
    Jan 4 19:09:58 macbook-de-pancho-skywalker-3 kernel[0]: VBoxDrv: version 4.1.2 r73507; IOCtl version 0x190000; IDC version 0x10000; dev major=34
    Jan 4 19:09:58 macbook-de-pancho-skywalker-3 kernel[0]: MacAuthEvent en1 Auth result for: 00:21:00:48:50:90 MAC AUTH succeeded
    Jan 4 19:09:58 macbook-de-pancho-skywalker-3 kernel[0]: wlEvent: en1 en1 Link UP virtIf = 0
    Jan 4 19:09:58 macbook-de-pancho-skywalker-3 kernel[0]: AirPort: Link Up on en1
    Jan 4 19:09:58 macbook-de-pancho-skywalker-3 kernel[0]: en1: BSSID changed to 00:21:00:48:50:90
    Jan 4 19:09:59 macbook-de-pancho-skywalker-3 kernel[0]: VBoxFltDrv: version 4.1.2 r73507
    Jan 4 19:09:59 macbook-de-pancho-skywalker-3 kernel[0]: VBoxAdpDrv: version 4.1.2 r73507
    Jan 4 19:10:10 macbook-de-pancho-skywalker-3 kernel[0]: CODE SIGNING: cs_invalid_page(0x1000): p=159[ksadmin] clearing CS_VALID
    Jan 4 19:10:18 macbook-de-pancho-skywalker-3 kernel[0]: CODE SIGNING: cs_invalid_page(0x1000): p=166[ksadmin] clearing CS_VALID
    Jan 4 19:11:00 macbook-de-pancho-skywalker-3 kernel[0]: CODE SIGNING: cs_invalid_page(0x1000): p=207[GoogleSoftwareUp] clearing CS_VALID

    ----------

    And again at 19:49

    Jan 4 19:11:02 macbook-de-pancho-skywalker-3 com.apple.launchd.peruser.501[130] (com.apple.mrt.uiagent[197]): Exited with code: 255
    Jan 4 19:11:05 macbook-de-pancho-skywalker-3 GeekTool Helper[217]: GeekTool 3 version 311 running
    Jan 4 19:11:16 macbook-de-pancho-skywalker-3 [0x0-0x29029].com.apple.systemevents[229]: com.apple.FolderActions.enabled: Already loaded
    Jan 4 19:11:33 macbook-de-pancho-skywalker-3 [0x0-0x6006].com.google.Chrome[145]: [237:2819:0104/191133:ERROR:base_feature_provider.cc(122)] manifestTypes: Allowing web_page contexts requires supplying a value for matches.
    Jan 4 19:11:54 macbook-de-pancho-skywalker-3 [0x0-0x6006].com.google.Chrome[145]: [145:25091:0104/191154:ERROR:backend_impl.cc(987)] Critical error found -8
    Jan 4 19:11:59 macbook-de-pancho-skywalker-3 Microsoft Word[143]: CGBitmapContextGetData: invalid context 0xf444300
    Jan 4 19:12:01: --- last message repeated 63 times ---
    Jan 4 19:12:01 macbook-de-pancho-skywalker-3 [0x0-0x6006].com.google.Chrome[145]: [239:2819:0104/191201:ERROR:base_feature_provider.cc(122)] manifestTypes: Allowing web_page contexts requires supplying a value for matches.
    Jan 4 19:12:09 macbook-de-pancho-skywalker-3 Microsoft Word[143]: CGBitmapContextGetData: invalid context 0xf444300
    Jan 4 19:12:30: --- last message repeated 134 times ---
    Jan 4 19:12:30 macbook-de-pancho-skywalker-3 [0x0-0x6006].com.google.Chrome[145]: [245:2819:0104/191230:ERROR:base_feature_provider.cc(122)] manifestTypes: Allowing web_page contexts requires supplying a value for matches.
    Jan 4 19:12:51 macbook-de-pancho-skywalker-3 [0x0-0x6006].com.google.Chrome[145]: [247:2819:0104/191251:ERROR:base_feature_provider.cc(122)] manifestTypes: Allowing web_page contexts requires supplying a value for matches.
    Jan 4 19:14:57 macbook-de-pancho-skywalker-3 Microsoft Word[143]: CGBitmapContextGetData: invalid context 0xf444300
    Jan 4 19:15:05: --- last message repeated 58 times ---
    Jan 4 19:15:05 macbook-de-pancho-skywalker-3 Finder[151]: --ImageKit Error: IKGLTextCache::createTexture glerror 506 before creating texture
    Jan 4 19:15:05 macbook-de-pancho-skywalker-3 Finder[151]: --ImageKit Error: updateGLTextureWithBitmapData: glPixelStorei returned an error : 506 (subSize=[154.000000,18.000000] offset [151.000000,0.000000] glID:2, context:0x7fed2d66a060)
    Jan 4 19:15:05 macbook-de-pancho-skywalker-3 Finder[151]: --ImageKit Error: updateGLTextureWithBitmapData: glPixelStorei returned an error : 506 (subSize=[158.000000,18.000000] offset [305.000000,0.000000] glID:2, context:0x7fed2d66a060)
    Jan 4 19:15:05 macbook-de-pancho-skywalker-3 Finder[151]: --ImageKit Error: updateGLTextureWithBitmapData: glPixelStorei returned an error : 506 (subSize=[158.000000,18.000000] offset [463.000000,0.000000] glID:2, context:0x7fed2d66a060)
    Jan 4 19:15:05 macbook-de-pancho-skywalker-3 Finder[151]: --ImageKit Error: error before reading pixels: 506
    Jan 4 19:15:05 macbook-de-pancho-skywalker-3 Finder[151]: --ImageKit Error: error after reading pixels: 506
    Jan 4 19:15:40 macbook-de-pancho-skywalker-3 [0x0-0x6006].com.google.Chrome[145]: [267:2819:0104/191540:ERROR:base_feature_provider.cc(122)] manifestTypes: Allowing web_page contexts requires supplying a value for matches.
    Jan 4 19:15:45 macbook-de-pancho-skywalker-3 [0x0-0x6006].com.google.Chrome[145]: [269:2819:0104/191545:ERROR:base_feature_provider.cc(122)] manifestTypes: Allowing web_page contexts requires supplying a value for matches.
    Jan 4 19:19:41 macbook-de-pancho-skywalker-3 [0x0-0x6006].com.google.Chrome[145]: [294:2819:0104/191941:ERROR:base_feature_provider.cc(122)] manifestTypes: Allowing web_page contexts requires supplying a value for matches.
    Jan 4 19:19:45 macbook-de-pancho-skywalker-3 [0x0-0x6006].com.google.Chrome[145]: [296:2819:0104/191945:ERROR:base_feature_provider.cc(122)] manifestTypes: Allowing web_page contexts requires supplying a value for matches.
    Jan 4 19:19:46 macbook-de-pancho-skywalker-3 [0x0-0x6006].com.google.Chrome[145]: [295:2819:0104/191946:ERROR:base_feature_provider.cc(122)] manifestTypes: Allowing web_page contexts requires supplying a value for matches.
    Jan 4 19:20:13 macbook-de-pancho-skywalker-3 [0x0-0x6006].com.google.Chrome[145]: [412:2819:0104/192013:ERROR:base_feature_provider.cc(122)] manifestTypes: Allowing web_page contexts requires supplying a value for matches.
    Jan 4 19:23:02 macbook-de-pancho-skywalker-3 [0x0-0x6006].com.google.Chrome[145]: [423:2819:0104/192302:ERROR:base_feature_provider.cc(122)] manifestTypes: Allowing web_page contexts requires supplying a value for matches.
    Jan 4 19:23:06 macbook-de-pancho-skywalker-3 [0x0-0x6006].com.google.Chrome[145]: [424:2819:0104/192306:ERROR:base_feature_provider.cc(122)] manifestTypes: Allowing web_page contexts requires supplying a value for matches.
    Jan 4 19:24:21 macbook-de-pancho-skywalker-3 [0x0-0x6006].com.google.Chrome[145]: [431:2819:0104/192421:ERROR:base_feature_provider.cc(122)] manifestTypes: Allowing web_page contexts requires supplying a value for matches.
    Jan 4 19:26:45 macbook-de-pancho-skywalker-3 [0x0-0x6006].com.google.Chrome[145]: [438:2819:0104/192645:ERROR:base_feature_provider.cc(122)] manifestTypes: Allowing web_page contexts requires supplying a value for matches.
    Jan 4 19:26:59 macbook-de-pancho-skywalker-3 [0x0-0x6006].com.google.Chrome[145]: [439:2819:0104/192659:ERROR:base_feature_provider.cc(122)] manifestTypes: Allowing web_page contexts requires supplying a value for matches.
    Jan 4 19:28:22 macbook-de-pancho-skywalker-3 [0x0-0x6006].com.google.Chrome[145]: [446:2819:0104/192822:ERROR:base_feature_provider.cc(122)] manifestTypes: Allowing web_page contexts requires supplying a value for matches.
    Jan 4 19:30:33 macbook-de-pancho-skywalker-3 [0x0-0x6006].com.google.Chrome[145]: [460:2819:0104/193033:ERROR:base_feature_provider.cc(122)] manifestTypes: Allowing web_page contexts requires supplying a value for matches.
    Jan 4 19:31:26 macbook-de-pancho-skywalker-3 [0x0-0x6006].com.google.Chrome[145]: [466:2819:0104/193126:ERROR:base_feature_provider.cc(122)] manifestTypes: Allowing web_page contexts requires supplying a value for matches.
    Jan 4 19:31:50 macbook-de-pancho-skywalker-3 [0x0-0x6006].com.google.Chrome[145]: [467:2819:0104/193150:ERROR:base_feature_provider.cc(122)] manifestTypes: Allowing web_page contexts requires supplying a value for matches.
    Jan 4 19:47:25 localhost fseventsd[13]: event logs in /.fseventsd out of sync with volume. destroying old logs. (1540 18 2245)
    Jan 4 19:47:25 localhost fseventsd[13]: log dir: /.fseventsd getting new uuid: 91FE2DFC-A17F-4729-BC25-E5F749278C64
    Jan 4 19:47:06 localhost bootlog[0]: BOOT_TIME 1388875626 0
    Jan 4 19:47:10 localhost com.apple.launchd[1]: *** launchd[1] has started up. ***
    Jan 4 19:47:24 localhost com.apple.launchd[1] (com.apple.powerd): Unknown value for key POSIXSpawnType: Interactive
    Jan 4 19:47:24 localhost com.apple.launchd[1] (com.apple.sandboxd): Unknown value for key POSIXSpawnType: Interactive
    Jan 4 19:47:24 localhost com.apple.launchd[1] (com.apple.usbmuxd): Unknown value for key POSIXSpawnType: Interactive
    Jan 4 19:47:29 localhost UserEventAgent[11]: starting CaptiveNetworkSupport as SystemEventAgent built May 25 2011 12:27:35
    Jan 4 19:47:29 localhost UserEventAgent[11]: WirelessAirPortDeviceNameCopy(): no BSD interface name found for object 12551
    Jan 4 19:47:29 localhost UserEventAgent[11]: CaptiveNetworkSupport:CaptiveSCCopyWiFiDevices:388 WiFi Device Name == NULL
    Jan 4 19:47:29 localhost com.apple.ucupdate.plist[23]: ucupdate: Checked 1 update, no match found.
    Jan 4 19:47:29 localhost com.apple.pfctl[32]: No ALTQ support in kernel
    Jan 4 19:47:29 localhost com.apple.pfctl[32]: ALTQ related functions disabled
    Jan 4 19:47:41 localhost com.apple.usbmuxd[22]: usbmuxd-323.1 on Oct 3 2013 at 12:43:24, running 64 bit
    Jan 4 19:47:41 localhost mDNSResponder[36]: mDNSResponder mDNSResponder-320.16 (Jul 19 2012 21:07:07) starting OSXVers 11
    Jan 4 19:47:43 localhost airportd[67]: _processDLILEvent: en1 attached (down)
    Jan 4 19:47:45 localhost mds[35]: (Normal) FMW: FMW 0 0
    Jan 4 19:47:45 localhost UserEventAgent[11]: CaptiveNetworkSupport:CreateInterfaceWatchList:278 8 WiFi Devices Found.
    Jan 4 19:47:45 localhost UserEventAgent[11]: CaptiveNetworkSupport:CaptivePublishState:1211 en1 - PreProbe
    Jan 4 19:47:48: --- last message repeated 2 times ---
    Jan 4 19:47:46 macbook-de-pancho-skywalker-3 configd[16]: setting hostname to "macbook-de-pancho-skywalker-3.local"
    Jan 4 19:47:46 macbook-de-pancho-skywalker-3 configd[16]: network configuration changed.
    Jan 4 19:47:47 macbook-de-pancho-skywalker-3 com.apple.SystemStarter[24]: ls: /Applications/VirtualBox.app/Contents/MacOS/*-amd64: No such file or directory
     
  2. panchoskywalker thread starter macrumors newbie

    Joined:
    Jan 4, 2014
    Location:
    chile
    #2
    Jan 4 19:47:47 macbook-de-pancho-skywalker-3 com.apple.SystemStarter[24]: Loading VBoxDrv.kext
    Jan 4 19:47:47 macbook-de-pancho-skywalker-3 com.apple.SystemStarter[24]: Loading VBoxUSB.kext
    Jan 4 19:47:47 macbook-de-pancho-skywalker-3 com.apple.SystemStarter[24]: Loading VBoxNetFlt.kext
    Jan 4 19:47:48 macbook-de-pancho-skywalker-3 com.apple.SystemStarter[24]: Loading VBoxNetAdp.kext
    Jan 4 19:47:49 macbook-de-pancho-skywalker-3 mDNSResponder[36]: D2D_IPC: Loaded
    Jan 4 19:47:49 macbook-de-pancho-skywalker-3 mDNSResponder[36]: D2DInitialize succeeded
    Jan 4 19:47:49 macbook-de-pancho-skywalker-3 configd[16]: network configuration changed.
    Jan 4 19:47:49: --- last message repeated 1 time ---
    Jan 4 19:47:49 macbook-de-pancho-skywalker-3 systemkeychain[63]: done file: /var/run/systemkeychaincheck.done
    Jan 4 19:47:49 macbook-de-pancho-skywalker-3 UserEventAgent[11]: ServermgrdRegistration cannot load config data
    Jan 4 19:47:49 macbook-de-pancho-skywalker-3 UserEventAgent[11]: get_backup_share_points no AFP
    Jan 4 19:47:49 macbook-de-pancho-skywalker-3 launchdadd[106]: FAILURE: Could not send MIG reply: 0x10000003
    Jan 4 19:47:49 macbook-de-pancho-skywalker-3 loginwindow[38]: Login Window Application Started
    Jan 4 19:47:50 macbook-de-pancho-skywalker-3 netbiosd[72]: Unable to start NetBIOS name service:
    Jan 4 19:47:52 macbook-de-pancho-skywalker-3 rpcsvchost[110]: sandbox_init: com.apple.msrpc.netlogon.sb succeeded
    Jan 4 19:47:56 macbook-de-pancho-skywalker-3 configd[16]: network configuration changed.
    Jan 4 19:47:56 macbook-de-pancho-skywalker-3 UserEventAgent[11]: CaptiveNetworkSupport:CaptivePublishState:1211 en1 - Probe
    Jan 4 19:47:56 macbook-de-pancho-skywalker-3 UserEventAgent[11]: CaptiveNetworkSupport:CNSPreferences:60 Creating new preferences
    Jan 4 19:47:56 macbook-de-pancho-skywalker-3 UserEventAgent[11]: CaptiveNetworkSupport:CaptiveStartDetect:2343 Bypassing probe on PAULINA because it is protected and not on the exception list
    Jan 4 19:47:56 macbook-de-pancho-skywalker-3 UserEventAgent[11]: CaptiveNetworkSupport:CaptivePublishState:1211 en1 - Unknown
    Jan 4 19:47:56 macbook-de-pancho-skywalker-3 configd[16]: network configuration changed.
    Jan 4 19:47:57 macbook-de-pancho-skywalker-3 airportd[67]: _doAutoJoin: Already associated to “PAULINA”. Bailing on auto-join.
    Jan 4 19:47:59 macbook-de-pancho-skywalker-3 loginwindow[38]: **DMPROXY** Found `/System/Library/CoreServices/DMProxy'.
    Jan 4 19:48:00 macbook-de-pancho-skywalker-3 airportd[67]: _doAutoJoin: Already associated to “PAULINA”. Bailing on auto-join.
    Jan 4 19:48:00 macbook-de-pancho-skywalker-3 com.apple.launchctl.LoginWindow[118]: com.apple.findmymacmessenger: Already loaded
    Jan 4 19:48:00 macbook-de-pancho-skywalker-3 loginwindow[38]: Login Window Started Security Agent
    Jan 4 19:48:00 macbook-de-pancho-skywalker-3 mds[35]: (/.Spotlight-V100/Store-V2/C764FB8B-5E75-4DFC-9FAA-90D2AE79221A)(Error) IndexPath in openReverseStore:Successfully recovered from shadow with state d00d0dd0
    Jan 4 19:48:00 macbook-de-pancho-skywalker-3 SecurityAgent[125]: Echo enabled
    Jan 4 19:48:00 macbook-de-pancho-skywalker-3 SecurityAgent[125]: User info context values set for panchoskywalker
    Jan 4 19:48:01 macbook-de-pancho-skywalker-3 WindowServer[109]: kCGErrorFailure: Set a breakpoint @ CGErrorBreakpoint() to catch errors as they are logged.
    Jan 4 19:48:01 macbook-de-pancho-skywalker-3 loginwindow[38]: Login Window - Returned from Security Agent
    Jan 4 19:48:01 macbook-de-pancho-skywalker-3 loginwindow[38]: USER_PROCESS: 38 console
    Jan 4 19:48:01 macbook-de-pancho-skywalker-3 airportd[67]: _doAutoJoin: Already associated to “PAULINA”. Bailing on auto-join.
    Jan 4 19:48:02 macbook-de-pancho-skywalker-3 com.apple.launchd.peruser.501[131] (com.apple.AirPortBaseStationAgent): Unknown value for key POSIXSpawnType: Background
    Jan 4 19:48:02 macbook-de-pancho-skywalker-3 com.apple.launchd.peruser.501[131] (com.apple.ReportCrash): Falling back to default Mach exception handler. Could not find: com.apple.ReportCrash.Self
    Jan 4 19:48:02 macbook-de-pancho-skywalker-3 com.apple.launchctl.Aqua[133]: load: option requires an argument -- D
    Jan 4 19:48:02 macbook-de-pancho-skywalker-3 com.apple.launchctl.Aqua[133]: usage: launchctl load [-wF] [-D <user|local|network|system|all>] paths...
    Jan 4 19:48:02 macbook-de-pancho-skywalker-3 com.apple.launchd.peruser.501[131] (com.apple.launchctl.Aqua[133]): Exited with code: 1
    Jan 4 19:48:02 macbook-de-pancho-skywalker-3 UserEventAgent[11]: CaptiveNetworkSupport:CNSServerRegisterUserAgent:1 87 new user agent port: 14603
    Jan 4 19:48:03 macbook-de-pancho-skywalker-3 coreaudiod[151]: FIXME: IOUnserialize has detected a string that is not valid UTF-8, "�
    ������
    �����P�{����@�{����".
    Jan 4 19:48:03: --- last message repeated 1 time ---
    Jan 4 19:48:03 macbook-de-pancho-skywalker-3 coreaudiod[151]: FIXME: IOUnserialize has detected a string that is not valid UTF-8, "��c".
    Jan 4 19:48:03: --- last message repeated 1 time ---
    Jan 4 19:48:03 macbook-de-pancho-skywalker-3 com.apple.audio.coreaudiod[151]: Jan 4 19:48:03 macbook-de-pancho-skywalker-3.local coreaudiod[151] <Error>: FIXME: IOUnserialize has detected a string that is not valid UTF-8, "�
    Jan 4 19:48:03 macbook-de-pancho-skywalker-3 com.apple.audio.coreaudiod[151]: ������
    Jan 4 19:48:03 macbook-de-pancho-skywalker-3 com.apple.audio.coreaudiod[151]: �����P�{����@�{����".
    Jan 4 19:48:03 macbook-de-pancho-skywalker-3 com.apple.audio.coreaudiod[151]: Jan 4 19:48:03 macbook-de-pancho-skywalker-3.local coreaudiod[151] <Error>: FIXME: IOUnserialize has detected a string that is not valid UTF-8, "�
    Jan 4 19:48:03 macbook-de-pancho-skywalker-3 com.apple.audio.coreaudiod[151]: ������
    Jan 4 19:48:03 macbook-de-pancho-skywalker-3 com.apple.audio.coreaudiod[151]: �����P�{����@�{����".
    Jan 4 19:48:03 macbook-de-pancho-skywalker-3 com.apple.audio.coreaudiod[151]: Jan 4 19:48:03 macbook-de-pancho-skywalker-3.local coreaudiod[151] <Error>: FIXME: IOUnserialize has detected a string that is not valid UTF-8, "��c".
    Jan 4 19:48:04: --- last message repeated 1 time ---
    Jan 4 19:48:04 macbook-de-pancho-skywalker-3 Finder[149]: ISGetIconFamilyFromStorage: seed mismatch for 231b0012, actual seed is 3352255a
    Jan 4 19:48:04: --- last message repeated 2 times ---
    Jan 4 19:48:04 macbook-de-pancho-skywalker-3 Finder[149]: _GetISImageRefFromIconRefInternal: could not retain image ref 0x231b0012 (err=-2580)
    Jan 4 19:48:04 macbook-de-pancho-skywalker-3 Finder[149]: ISGetIconFamilyFromStorage: seed mismatch for 231b0012, actual seed is 3352255a
    Jan 4 19:48:04 macbook-de-pancho-skywalker-3 Finder[149]: _GetISImageRefFromIconRefInternal: could not retain image ref 0x231b0012 (err=-2580)
    Jan 4 19:48:05 macbook-de-pancho-skywalker-3 [0x0-0x4004].com.google.Chrome[141]: [141:43523:0104/194805:ERROR:connection.cc(1030)] sqlite error 11, errno 0: database disk image is malformed
    Jan 4 19:48:06: --- last message repeated 2 times ---
    Jan 4 19:48:06 macbook-de-pancho-skywalker-3 com.apple.dock.extra[159]: Could not connect the action buttonPressed: to target of class NSApplication
    Jan 4 19:48:06: --- last message repeated 3 times ---
    Jan 4 19:48:06 macbook-de-pancho-skywalker-3 com.apple.dock.extra[159]: 2014-01-04 19:48:06.338 com.apple.dock.extra[159:1a07] Could not connect the action buttonPressed: to target of class NSApplication
    Jan 4 19:48:06 macbook-de-pancho-skywalker-3 com.apple.dock.extra[159]: 2014-01-04 19:48:06.340 com.apple.dock.extra[159:1a07] Could not connect the action buttonPressed: to target of class NSApplication
    Jan 4 19:48:06 macbook-de-pancho-skywalker-3 com.apple.dock.extra[159]: 2014-01-04 19:48:06.341 com.apple.dock.extra[159:1a07] Could not connect the action buttonPressed: to target of class NSApplication
    Jan 4 19:48:11: --- last message repeated 1 time ---
    Jan 4 19:48:11 macbook-de-pancho-skywalker-3 [0x0-0x4004].com.google.Chrome[141]: [158:2819:0104/194811:ERROR:base_feature_provider.cc(122)] manifestTypes: Allowing web_page contexts requires supplying a value for matches.
    Jan 4 19:48:12 macbook-de-pancho-skywalker-3 [0x0-0x4004].com.google.Chrome[141]: [171:2819:0104/194812:ERROR:base_feature_provider.cc(122)] manifestTypes: Allowing web_page contexts requires supplying a value for matches.
    Jan 4 19:48:12 macbook-de-pancho-skywalker-3 [0x0-0x4004].com.google.Chrome[141]: [172:2819:0104/194812:ERROR:base_feature_provider.cc(122)] manifestTypes: Allowing web_page contexts requires supplying a value for matches.
    Jan 4 19:48:13 macbook-de-pancho-skywalker-3 [0x0-0x4004].com.google.Chrome[141]: [141:25859:0104/194813:ERROR:base_feature_provider.cc(122)] manifestTypes: Allowing web_page contexts requires supplying a value for matches.
    Jan 4 19:48:14 macbook-de-pancho-skywalker-3 [0x0-0x4004].com.google.Chrome[141]: [173:2819:0104/194814:ERROR:base_feature_provider.cc(122)] manifestTypes: Allowing web_page contexts requires supplying a value for matches.
    Jan 4 19:48:21 macbook-de-pancho-skywalker-3 com.apple.launchd[1] (com.apple.coreservices.appleid.authentication[123]): Exit timeout elapsed (20 seconds). Killing
    Jan 4 19:48:23 macbook-de-pancho-skywalker-3 com.apple.launchd.peruser.501[131] (com.adobe.ARM.ad895013aeb33ea6e968d9fdc06c0eb42c7 c2a5229d98d64ad002716[197]): posix_spawn("/Applications/Adobe Acrobat 8 Professional/Adobe Acrobat Professional.app/Contents/MacOS/Updater/Adobe Acrobat Updater Helper.app/Contents/MacOS/Adobe Acrobat Updater Helper", ...): No such file or directory
    Jan 4 19:48:23 macbook-de-pancho-skywalker-3 com.apple.launchd.peruser.501[131] (com.adobe.ARM.ad895013aeb33ea6e968d9fdc06c0eb42c7 c2a5229d98d64ad002716[197]): Exited with code: 1
    Jan 4 19:48:25 macbook-de-pancho-skywalker-3 com.apple.launchd.peruser.501[131] (com.apple.mrt.uiagent[185]): Exited with code: 255
    Jan 4 19:48:25 macbook-de-pancho-skywalker-3 RealPlayer Downloader Agent[201]: In '__CFPasteboardCopyData', file /SourceCache/CF/CF-635.21/AppServices.subproj/CFPasteboard.c, line 2372, during unlock, spin lock 0x30b5018 has value 0x0, which is not locked. The memory has been smashed or the lock is being unlocked when not locked.
    Jan 4 19:48:26 macbook-de-pancho-skywalker-3 GeekTool Helper[203]: GeekTool 3 version 311 running
    Jan 4 19:48:34 macbook-de-pancho-skywalker-3 [0x0-0x4004].com.google.Chrome[141]: [215:2819:0104/194834:ERROR:base_feature_provider.cc(122)] manifestTypes: Allowing web_page contexts requires supplying a value for matches.
    Jan 4 19:48:34 macbook-de-pancho-skywalker-3 [0x0-0x4004].com.google.Chrome[141]: [214:2819:0104/194834:ERROR:base_feature_provider.cc(122)] manifestTypes: Allowing web_page contexts requires supplying a value for matches.
    Jan 4 19:48:34 macbook-de-pancho-skywalker-3 [0x0-0x4004].com.google.Chrome[141]: [219:2819:0104/194834:ERROR:base_feature_provider.cc(122)] manifestTypes: Allowing web_page contexts requires supplying a value for matches.
    Jan 4 19:48:34 macbook-de-pancho-skywalker-3 [0x0-0x4004].com.google.Chrome[141]: [222:2819:0104/194834:ERROR:base_feature_provider.cc(122)] manifestTypes: Allowing web_page contexts requires supplying a value for matches.
    Jan 4 19:48:35 macbook-de-pancho-skywalker-3 [0x0-0x4004].com.google.Chrome[141]: [221:2819:0104/194835:ERROR:base_feature_provider.cc(122)] manifestTypes: Allowing web_page contexts requires supplying a value for matches.
    Jan 4 19:48:35 macbook-de-pancho-skywalker-3 [0x0-0x4004].com.google.Chrome[141]: [220:2819:0104/194835:ERROR:base_feature_provider.cc(122)] manifestTypes: Allowing web_page contexts requires supplying a value for matches.
    Jan 4 19:48:35 macbook-de-pancho-skywalker-3 [0x0-0x4004].com.google.Chrome[141]: [223:2819:0104/194835:ERROR:base_feature_provider.cc(122)] manifestTypes: Allowing web_page contexts requires supplying a value for matches.
    Jan 4 19:48:36 macbook-de-pancho-skywalker-3 [0x0-0x4004].com.google.Chrome[141]: [224:2819:0104/194836:ERROR:base_feature_provider.cc(122)] manifestTypes: Allowing web_page contexts requires supplying a value for matches.
    Jan 4 19:48:37 macbook-de-pancho-skywalker-3 [0x0-0x20020].com.apple.systemevents[216]: com.apple.FolderActions.enabled: Already loaded
    Jan 4 19:48:40 macbook-de-pancho-skywalker-3 [0x0-0x4004].com.google.Chrome[141]: [225:2819:0104/194840:ERROR:base_feature_provider.cc(122)] manifestTypes: Allowing web_page contexts requires supplying a value for matches.
    Jan 4 19:49:36 macbook-de-pancho-skywalker-3 [0x0-0x4004].com.google.Chrome[141]: [234:2819:0104/194936:ERROR:base_feature_provider.cc(122)] manifestTypes: Allowing web_page contexts requires supplying a value for matches.
    Jan 4 19:49:41 macbook-de-pancho-skywalker-3 [0x0-0x4004].com.google.Chrome[141]: [235:2819:0104/194941:ERROR:base_feature_provider.cc(122)] manifestTypes: Allowing web_page contexts requires supplying a value for matches.
     
  3. panchoskywalker thread starter macrumors newbie

    Joined:
    Jan 4, 2014
    Location:
    chile
    #3
    And again, twice in a row. I noticed that if when it was on battery when it crashed I have to switch to power supply otherwise it will happen again within 10 minutes, it also work the other way around.

    Jan 6 22:11:06 localhost kernel[0]: Darwin Kernel Version 11.4.2: Thu Aug 23 16:25:48 PDT 2012; root:xnu-1699.32.7~1/RELEASE_X86_64
    Jan 6 22:11:06 localhost kernel[0]: vm_page_bootstrap: 1962449 free pages and 52783 wired pages
    Jan 6 22:11:06 localhost kernel[0]: kext submap [0xffffff7f80736000 - 0xffffff8000000000], kernel text [0xffffff8000200000 - 0xffffff8000736000]
    Jan 6 22:11:06 localhost kernel[0]: zone leak detection enabled
    Jan 6 22:11:06 localhost kernel[0]: standard timeslicing quantum is 10000 us
    Jan 6 22:11:06 localhost kernel[0]: mig_table_max_displ = 73
    Jan 6 22:11:06 localhost kernel[0]: AppleACPICPU: ProcessorId=0 LocalApicId=0 Enabled
    Jan 6 22:11:06 localhost kernel[0]: AppleACPICPU: ProcessorId=1 LocalApicId=1 Enabled
    Jan 6 22:11:06 localhost kernel[0]: calling mpo_policy_init for TMSafetyNet
    Jan 6 22:11:06 localhost kernel[0]: Security policy loaded: Safety net for Time Machine (TMSafetyNet)
    Jan 6 22:11:06 localhost kernel[0]: calling mpo_policy_init for Sandbox
    Jan 6 22:11:06 localhost kernel[0]: Security policy loaded: Seatbelt sandbox policy (Sandbox)
    Jan 6 22:11:06 localhost kernel[0]: calling mpo_policy_init for Quarantine
    Jan 6 22:11:06 localhost kernel[0]: Security policy loaded: Quarantine policy (Quarantine)
    Jan 6 22:11:06 localhost kernel[0]: Copyright (c) 1982, 1986, 1989, 1991, 1993
    Jan 6 22:11:06 localhost kernel[0]: The Regents of the University of California. All rights reserved.
    Jan 6 22:11:06 localhost kernel[0]: MAC Framework successfully initialized
    Jan 6 22:11:06 localhost kernel[0]: using 16384 buffer headers and 10240 cluster IO buffer headers
    Jan 6 22:11:06 localhost kernel[0]: IOAPIC: Version 0x11 Vectors 64:87
    Jan 6 22:11:06 localhost kernel[0]: ACPI: System State [S0 S3 S4 S5]
    Jan 6 22:11:06 localhost kernel[0]: PFM64 (36 cpu) 0xf10000000, 0xf0000000
    Jan 6 22:11:06 localhost kernel[0]: [ PCI configuration begin ]
    Jan 6 22:11:06 localhost kernel[0]: console relocated to 0xf10010000
    Jan 6 22:11:06 localhost kernel[0]: PCI configuration changed (bridge=2 device=2 cardbus=0)
    Jan 6 22:11:06 localhost kernel[0]: [ PCI configuration end, bridges 4 devices 17 ]
    Jan 6 22:11:06 localhost kernel[0]: AppleIntelCPUPowerManagement: (built 16:32:09 Aug 23 2012) initialization complete
    Jan 6 22:11:06 localhost kernel[0]: mbinit: done [64 MB total pool size, (42/21) split]
    Jan 6 22:11:06 localhost kernel[0]: Pthread support ABORTS when sync kernel primitives misused
    Jan 6 22:11:06 localhost kernel[0]: com.apple.AppleFSCompressionTypeZlib kmod start
    Jan 6 22:11:06 localhost kernel[0]: com.apple.AppleFSCompressionTypeDataless kmod start
    Jan 6 22:11:06 localhost kernel[0]: com.apple.AppleFSCompressionTypeZlib load succeeded
    Jan 6 22:11:06 localhost kernel[0]: com.apple.AppleFSCompressionTypeDataless load succeeded
    Jan 6 22:11:06 localhost kernel[0]: AppleIntelCPUPowerManagementClient: ready
    Jan 6 22:11:06 localhost kernel[0]: BTCOEXIST off
    Jan 6 22:11:06 localhost kernel[0]: wl0: Broadcom BCM432b 802.11 Wireless Controller
    Jan 6 22:11:06 localhost kernel[0]: 5.106.198.19
    Jan 6 22:11:06 localhost kernel[0]: [IOBluetoothHCIController::setConfigState] calling registerService
    Jan 6 22:11:06 localhost kernel[0]: rooting via boot-uuid from /chosen: 75E558EA-8789-39E9-8865-840E3E32B6F6
    Jan 6 22:11:06 localhost kernel[0]: Waiting on <dict ID="0"><key>IOProviderClass</key><string ID="1">IOResources</string><key>IOResourceMatch</key><string ID="2">boot-uuid-media</string></dict>
    Jan 6 22:11:06 localhost kernel[0]: Got boot device = IOService:/AppleACPIPlatformExpert/PCI0@0/AppleACPIPCI/SATA@B/AppleMCP79AHCI/PRT0@0/IOAHCIDevice@0/AppleAHCIDiskDriver/IOAHCIBlockStorageDevice/IOBlockStorageDriver/FUJITSU MHZ2160BH FFS G1 Media/IOGUIDPartitionScheme/Untitled@2
    Jan 6 22:11:06 localhost kernel[0]: BSD root: disk0s2, major 14, minor 2
    Jan 6 22:11:06 localhost kernel[0]: jnl: unknown-dev: replay_journal: from: 10377728 to: 12125696 (joffset 0x4a8000)
    Jan 6 22:11:06 localhost kernel[0]: jnl: unknown-dev: journal replay done.
    Jan 6 22:11:06 localhost kernel[0]: Kernel is LP64
    Jan 6 22:11:06 localhost kernel[0]: hfs: Removed 158 orphaned / unlinked files and 38 directories
    Jan 6 22:11:06 localhost kernel[0]: Waiting for DSMOS...
    Jan 6 22:11:07 localhost kernel[0]: NVEthernet: Ethernet address 00:23:32:ce:23:84
    Jan 6 22:11:07 localhost kernel[0]: AirPort_Brcm4331: Ethernet address 00:23:6c:84:86:e6
    Jan 6 22:11:07 localhost kernel[0]: IO80211Controller::dataLinkLayerAttachComplete(): adding AppleEFINVRAM notification
    Jan 6 22:11:09 localhost kernel[0]: Previous Shutdown Cause: -1
    Jan 6 22:11:09 localhost kernel[0]: SMC::smcInitHelper ERROR: MMIO regMap == NULL - fall back to old SMC mode
    Jan 6 22:11:09 localhost kernel[0]: NVDANV50HAL loaded and registered.
    Jan 6 22:11:10 localhost kernel[0]: SMC::smcReadKeyAction ERROR: smcReadData8 failed for key MOTP (kSMCKeyNotFound)
    Jan 6 22:11:10 localhost kernel[0]: DSMOS has arrived
    Jan 6 22:11:10 localhost kernel[0]: SMC::smcReadKeyAction ERROR: smcReadData8 failed for key BEMB (kSMCKeyNotFound)
    Jan 6 22:11:15 localhost kernel[0]: macx_swapon SUCCESS
    Jan 6 22:11:21 localhost kernel[0]: in func createVirtualInterface ifRole = 1
    Jan 6 22:11:21 localhost kernel[0]: Created virtif 0xffffff8013129400 p2p0
    Jan 6 22:11:22 macbook-de-pancho-skywalker-3 kernel[0]: 00000000 00000020 NVEthernet::setLinkStatus - not Active
    Jan 6 22:11:22 macbook-de-pancho-skywalker-3 kernel[0]: AirPort: Link Down on en1. Reason 1 (Unspecified).
    Jan 6 22:11:25 macbook-de-pancho-skywalker-3 kernel[0]: ast_pending=0xffffff80002af8b0
    Jan 6 22:11:25 macbook-de-pancho-skywalker-3 kernel[0]: cpu_interrupt=0xffffff80002cb890
    Jan 6 22:11:25 macbook-de-pancho-skywalker-3 kernel[0]: vboxdrv: fAsync=0 offMin=0x84b offMax=0x12c7
    Jan 6 22:11:25 macbook-de-pancho-skywalker-3 kernel[0]: VBoxDrv: version 4.1.2 r73507; IOCtl version 0x190000; IDC version 0x10000; dev major=34
    Jan 6 22:11:25 macbook-de-pancho-skywalker-3 kernel[0]: VBoxFltDrv: version 4.1.2 r73507
    Jan 6 22:11:25 macbook-de-pancho-skywalker-3 kernel[0]: VBoxAdpDrv: version 4.1.2 r73507
    Jan 6 22:11:25 macbook-de-pancho-skywalker-3 kernel[0]: MacAuthEvent en1 Auth result for: 00:21:00:48:50:90 MAC AUTH succeeded
    Jan 6 22:11:25 macbook-de-pancho-skywalker-3 kernel[0]: wlEvent: en1 en1 Link UP virtIf = 0
    Jan 6 22:11:25 macbook-de-pancho-skywalker-3 kernel[0]: AirPort: Link Up on en1
    Jan 6 22:11:25 macbook-de-pancho-skywalker-3 kernel[0]: en1: BSSID changed to 00:21:00:48:50:90
    Jan 6 22:11:39 macbook-de-pancho-skywalker-3 kernel[0]: CODE SIGNING: cs_invalid_page(0x1000): p=158[ksadmin] clearing CS_VALID
    Jan 6 22:11:43 macbook-de-pancho-skywalker-3 kernel[0]: CODE SIGNING: cs_invalid_page(0x1000): p=163[ksadmin] clearing CS_VALID
    Jan 6 22:13:32 localhost kernel[0]: Darwin Kernel Version 11.4.2: Thu Aug 23 16:25:48 PDT 2012; root:xnu-1699.32.7~1/RELEASE_X86_64
    Jan 6 22:13:32 localhost kernel[0]: vm_page_bootstrap: 1962449 free pages and 52783 wired pages
    Jan 6 22:13:32 localhost kernel[0]: kext submap [0xffffff7f80736000 - 0xffffff8000000000], kernel text [0xffffff8000200000 - 0xffffff8000736000]
    Jan 6 22:13:32 localhost kernel[0]: zone leak detection enabled
    Jan 6 22:13:32 localhost kernel[0]: standard timeslicing quantum is 10000 us
    Jan 6 22:13:32 localhost kernel[0]: mig_table_max_displ = 73
    Jan 6 22:13:32 localhost kernel[0]: AppleACPICPU: ProcessorId=0 LocalApicId=0 Enabled
    Jan 6 22:13:32 localhost kernel[0]: AppleACPICPU: ProcessorId=1 LocalApicId=1 Enabled
    Jan 6 22:13:32 localhost kernel[0]: calling mpo_policy_init for TMSafetyNet
    Jan 6 22:13:32 localhost kernel[0]: Security policy loaded: Safety net for Time Machine (TMSafetyNet)
    Jan 6 22:13:32 localhost kernel[0]: calling mpo_policy_init for Sandbox
    Jan 6 22:13:32 localhost kernel[0]: Security policy loaded: Seatbelt sandbox policy (Sandbox)
    Jan 6 22:13:32 localhost kernel[0]: calling mpo_policy_init for Quarantine
    Jan 6 22:13:32 localhost kernel[0]: Security policy loaded: Quarantine policy (Quarantine)
    Jan 6 22:13:32 localhost kernel[0]: Copyright (c) 1982, 1986, 1989, 1991, 1993
    Jan 6 22:13:32 localhost kernel[0]: The Regents of the University of California. All rights reserved.
    Jan 6 22:13:32 localhost kernel[0]: MAC Framework successfully initialized
    Jan 6 22:13:32 localhost kernel[0]: using 16384 buffer headers and 10240 cluster IO buffer headers
    Jan 6 22:13:32 localhost kernel[0]: IOAPIC: Version 0x11 Vectors 64:87
    Jan 6 22:13:32 localhost kernel[0]: ACPI: System State [S0 S3 S4 S5]
    Jan 6 22:13:32 localhost kernel[0]: PFM64 (36 cpu) 0xf10000000, 0xf0000000
    Jan 6 22:13:32 localhost kernel[0]: [ PCI configuration begin ]
    Jan 6 22:13:32 localhost kernel[0]: console relocated to 0xf10010000
    Jan 6 22:13:32 localhost kernel[0]: PCI configuration changed (bridge=2 device=2 cardbus=0)
    Jan 6 22:13:32 localhost kernel[0]: [ PCI configuration end, bridges 4 devices 17 ]
    Jan 6 22:13:32 localhost kernel[0]: AppleIntelCPUPowerManagement: (built 16:32:09 Aug 23 2012) initialization complete
    Jan 6 22:13:32 localhost kernel[0]: mbinit: done [64 MB total pool size, (42/21) split]
    Jan 6 22:13:32 localhost kernel[0]: Pthread support ABORTS when sync kernel primitives misused
    Jan 6 22:13:32 localhost kernel[0]: com.apple.AppleFSCompressionTypeZlib kmod start
    Jan 6 22:13:32 localhost kernel[0]: com.apple.AppleFSCompressionTypeDataless kmod start
    Jan 6 22:13:32 localhost kernel[0]: com.apple.AppleFSCompressionTypeZlib load succeeded
    Jan 6 22:13:32 localhost kernel[0]: com.apple.AppleFSCompressionTypeDataless load succeeded
    Jan 6 22:13:32 localhost kernel[0]: AppleIntelCPUPowerManagementClient: ready
    Jan 6 22:13:32 localhost kernel[0]: BTCOEXIST off
    Jan 6 22:13:32 localhost kernel[0]: wl0: Broadcom BCM432b 802.11 Wireless Controller
    Jan 6 22:13:32 localhost kernel[0]: 5.106.198.19
    Jan 6 22:13:32 localhost kernel[0]: [IOBluetoothHCIController::setConfigState] calling registerService
    Jan 6 22:13:32 localhost kernel[0]: rooting via boot-uuid from /chosen: 75E558EA-8789-39E9-8865-840E3E32B6F6
    Jan 6 22:13:32 localhost kernel[0]: Waiting on <dict ID="0"><key>IOProviderClass</key><string ID="1">IOResources</string><key>IOResourceMatch</key><string ID="2">boot-uuid-media</string></dict>
    Jan 6 22:13:32 localhost kernel[0]: Got boot device = IOService:/AppleACPIPlatformExpert/PCI0@0/AppleACPIPCI/SATA@B/AppleMCP79AHCI/PRT0@0/IOAHCIDevice@0/AppleAHCIDiskDriver/IOAHCIBlockStorageDevice/IOBlockStorageDriver/FUJITSU MHZ2160BH FFS G1 Media/IOGUIDPartitionScheme/Untitled@2
    Jan 6 22:13:32 localhost kernel[0]: BSD root: disk0s2, major 14, minor 2
    Jan 6 22:13:32 localhost kernel[0]: jnl: unknown-dev: replay_journal: from: 9496576 to: 2284032 (joffset 0x4a8000)
    Jan 6 22:13:32 localhost kernel[0]: jnl: unknown-dev: examining extra transactions starting @ 2284032 / 0x22da00
    Jan 6 22:13:32 localhost kernel[0]: jnl: unknown-dev: Extra txn replay stopped @ 3202048 / 0x30dc00
    Jan 6 22:13:32 localhost kernel[0]: jnl: unknown-dev: journal replay done.
    Jan 6 22:13:32 localhost kernel[0]: Kernel is LP64
    Jan 6 22:13:32 localhost kernel[0]: hfs: Removed 17 orphaned / unlinked files and 18 directories
    Jan 6 22:13:35 localhost kernel[0]: NVEthernet: Ethernet address 00:23:32:ce:23:84
    Jan 6 22:13:35 localhost kernel[0]: AirPort_Brcm4331: Ethernet address 00:23:6c:84:86:e6
    Jan 6 22:13:35 localhost kernel[0]: IO80211Controller::dataLinkLayerAttachComplete(): adding AppleEFINVRAM notification
    Jan 6 22:13:38 localhost kernel[0]: macx_swapon SUCCESS
    Jan 6 22:13:41 localhost kernel[0]: Waiting for DSMOS...
    Jan 6 22:13:44 localhost kernel[0]: NVDANV50HAL loaded and registered.
    Jan 6 22:13:44 localhost kernel[0]: Previous Shutdown Cause: -1
    Jan 6 22:13:44 localhost kernel[0]: SMC::smcInitHelper ERROR: MMIO regMap == NULL - fall back to old SMC mode
    Jan 6 22:13:47 localhost kernel[0]: SMC::smcReadKeyAction ERROR: smcReadData8 failed for key MOTP (kSMCKeyNotFound)
    Jan 6 22:13:48 localhost kernel[0]: DSMOS has arrived
    Jan 6 22:13:48 localhost kernel[0]: SMC::smcReadKeyAction ERROR: smcReadData8 failed for key BEMB (kSMCKeyNotFound)
    Jan 6 22:13:50 localhost kernel[0]: in func createVirtualInterface ifRole = 1
    Jan 6 22:13:50 localhost kernel[0]: Created virtif 0xffffff8013024000 p2p0
    Jan 6 22:13:51 localhost kernel[0]: AirPort: Link Down on en1. Reason 8 (Disassociated because station leaving).
    Jan 6 22:13:51 localhost kernel[0]: 00000000 00000020 NVEthernet::setLinkStatus - not Active
    Jan 6 22:13:53 macbook-de-pancho-skywalker-3 kernel[0]: MacAuthEvent en1 Auth result for: 00:21:00:48:50:90 MAC AUTH succeeded
    Jan 6 22:13:53 macbook-de-pancho-skywalker-3 kernel[0]: wlEvent: en1 en1 Link UP virtIf = 0
    Jan 6 22:13:53 macbook-de-pancho-skywalker-3 kernel[0]: AirPort: Link Up on en1
    Jan 6 22:13:53 macbook-de-pancho-skywalker-3 kernel[0]: en1: BSSID changed to 00:21:00:48:50:90
    Jan 6 22:13:56 macbook-de-pancho-skywalker-3 kernel[0]: ast_pending=0xffffff80002af8b0
    Jan 6 22:13:56 macbook-de-pancho-skywalker-3 kernel[0]: cpu_interrupt=0xffffff80002cb890
    Jan 6 22:13:56 macbook-de-pancho-skywalker-3 kernel[0]: vboxdrv: fAsync=0 offMin=0x861 offMax=0x1518
    Jan 6 22:13:56 macbook-de-pancho-skywalker-3 kernel[0]: VBoxDrv: version 4.1.2 r73507; IOCtl version 0x190000; IDC version 0x10000; dev major=34
    Jan 6 22:14:00 macbook-de-pancho-skywalker-3 kernel[0]: VBoxFltDrv: version 4.1.2 r73507
    Jan 6 22:14:00 macbook-de-pancho-skywalker-3 kernel[0]: VBoxAdpDrv: version 4.1.2 r73507
    Jan 6 22:15:16 macbook-de-pancho-skywalker-3 kernel[0]: CODE SIGNING: cs_invalid_page(0x1000): p=177[ksadmin] clearing CS_VALID
    Jan 6 22:15:20 macbook-de-pancho-skywalker-3 kernel[0]: CODE SIGNING: cs_invalid_page(0x1000): p=191[GoogleSoftwareUp] clearing CS_VALID
    Jan 6 22:15:55 macbook-de-pancho-skywalker-3 kernel[0]: CODE SIGNING: cs_invalid_page(0x1000): p=226[ksadmin] clearing CS_VALID
     
  4. Altemose macrumors G3

    Altemose

    Joined:
    Mar 26, 2013
    Location:
    Elkton, Maryland
    #4
    It is potentially bad RAM as I didn't see anything too obvious. Do these crashes happen when not using Google Chrome or VirtualBox? If so then I think you found your answer. Otherwise try running a hardware test at boot and if it comes back with all passing scores then try an OS X reinstall.
     
  5. panchoskywalker thread starter macrumors newbie

    Joined:
    Jan 4, 2014
    Location:
    chile
    #5
    Thanks, I always use chrome, so I don't how it is when I'm not. I also though it could be RAM, originally it had 2gb but I updated it to 8GB, I tried to find the old RAM but I guess I throw it as I can't find it anywhere.

    In case it is RAM, is the solution buying new RAM? How can I be sure it won't happen again?
     

Share This Page